{"text_format":"3","workbook":"xlsx","n_sheets":5,"sheets":["LevelDifficultyConfig","Sheet1","Sheet2","Sheet3","Sheet4"],"not_rendered":{"external_links":5,"defined_names":1,"comments":2},"read":"whole","date_system":"1900"}

{"sheet":"LevelDifficultyConfig","index":0,"n_rows":307,"n_cols":17,"rows_kept":307}
[null,"Id","Name","Precondition","LevelLimit","PicShow","MonsterGroup","Cost","PreLevelCost","Exp","FirstReward","RandomReward","Show","RankTime","MaxCountPerDay","RecommendFightAbility","NoUse"]
[null,"int","string","int","int","int","int","mut,int#int,2","mut,int#int,2","int","mut,int#int,1","mut,int#int,1","mut,int#int,2","int","int","int","string"]
[null,2,3,2,2,3,2,2,2,2,4,4,3,2,2,2,0]
[null,"关卡ID","关卡名称","前置关卡","需要等级","新关卡开启拍脸图","关联的怪物组id","关卡结束扣除体力\n关卡消耗体力=预扣除+结束扣除","进入关卡预先扣除的体力","关卡经验奖励","首次通关奖励","关卡道具奖励组\n--每一次","显示","时间需求","每天最大可玩次数：\n0就是无限","推荐战力","备注"]
["默认值",0," ",0,0,0,0,"null","null",0,0,0,"null",0,0,0," "]
["正确性校对"]
["校对值"]
[null,1011,"简单-1-1",0,0,0,51011,"2#7","2#1",8,"5001","3001#401001","70101#1|14#100|3#10",180,0,300,1]
[null,1021,"简单-1-2",{"$f":"B8","v":1011},0,0,51012,"2#7","2#1",8,"5002","3002#401002","70201#1|14#100|3#10",180,0,300,2]
[null,1031,"简单-1-3",{"$f":"B9","v":1021},0,0,51013,{"$f":"H8","v":"2#7"},"2#1",8,"5003","3003#401003","70301#1|14#100|3#10",180,0,300,3]
[null,1041,"简单-1-4",1031,0,0,51014,{"$f":"H9","v":"2#7"},"2#1",8,"5004","3004#401004","70401#1|14#100|3#10",180,0,300,4]
[null,1051,"简单-1-5",1041,0,0,51015,{"$f":"H10","v":"2#7"},"2#1",8,"5005","3005#401005","70501#1|14#100|3#10",180,0,300,5]
[null,2011,"简单-2-1",1051,0,1,51016,{"$f":"H11","v":"2#7"},"2#1",8,"5006","3006#401006","70102#1|14#120|3#12",90,0,5369,{"$f":"Q8","v":1}]
[null,2021,"简单-2-2",2011,0,0,51017,{"$f":"H12","v":"2#7"},"2#1",8,"5007","3007#401007","70202#1|14#120|3#12",90,0,5369,{"$f":"Q9","v":2}]
[null,2031,"简单-2-3",2021,0,0,51018,{"$f":"H13","v":"2#7"},"2#1",8,5008,"3008#401008","70302#1|14#120|3#12",120,0,5369,3]
{"$rows_left_out":293}
{"sheet":"Sheet1","index":1,"n_rows":181,"n_cols":47,"rows_kept":181}
["关卡id","关卡名称","物品1","数量1","输出1","物品2","数量2","输出2","物品3","数量3","输出3","总输出","游戏天数","需要的总经验","关卡经验占比","单关经验","玩家等级_v0","刷本次数_v0","玩家等级_v15","刷本次数_v15","战力","修正战力",null,"天数","队伍等级","队伍人数","累计消耗",{"$nulls":3},"天数","V0等级","V1等级","V2等级","V3等级","V4等级","V5等级","V6等级","V7等级","V8等级","V9等级","V10等级","V11等级","V12等级","V13等级","V14等级","V15等级"]
[1011,"简单-1-1",11024,1,{"$f":"[1]!SUMSTRING(C2:D2,\"#\")","v":{"$error":"#NAME?"}},14,100,{"$f":"[1]!SUMSTRING(F2:G2,\"#\")","v":{"$error":"#NAME?"}},3,10,{"$f":"[1]!SUMSTRING(I2:J2,\"#\")","v":{"$error":"#NAME?"}},{"$f":"E2&\"|\"&H2&\"|\"&K2","v":{"$error":"#NAME?"}},0,{"$f":"N21/20","v":2178},{"$f":"N2*0.3","v":653.4},100,{"$f":"_xlfn.IFNA(VLOOKUP(M2,$AE$2:$AF$21,2,0),\"\")","v":""},{"$nulls":3},{"$f":"INT(VLOOKUP(M2,[2]战力等级细化!H:AA,20,FALSE))","v":3390},1007,null,1,88,5,43560,{"$nulls":3},1,22,23,23,24,25,25,26,26,27,27,27,28,28,29,29,29]
[1021,"简单-1-2",11025,1,{"$f":"[1]!SUMSTRING(C3:D3,\"#\")","v":{"$error":"#NAME?"}},14,100,{"$f":"[1]!SUMSTRING(F3:G3,\"#\")","v":{"$error":"#NAME?"}},3,10,{"$f":"[1]!SUMSTRING(I3:J3,\"#\")","v":{"$error":"#NAME?"}},{"$f":"E3&\"|\"&H3&\"|\"&K3","v":{"$error":"#NAME?"}},0,{"$f":"N2+$N$21/20","v":4356},{"$f":"N3*0.3","v":1306.8},105,{"$f":"_xlfn.IFNA(VLOOKUP(M3,$AE$2:$AF$21,2,0),\"\")","v":""},{"$nulls":3},{"$f":"INT(VLOOKUP(M3,[2]战力等级细化!H:AA,20,FALSE))","v":3390},{"$f":"INT(V2+($V$7-$V$2)/5)","v":1050},null,2,96,5,51360,{"$nulls":3},2,25,26,27,28,29,29,30,31,31,32,32,33,33,34,34,35]
[1031,"简单-1-3",11026,1,{"$f":"[1]!SUMSTRING(C4:D4,\"#\")","v":{"$error":"#NAME?"}},14,100,{"$f":"[1]!SUMSTRING(F4:G4,\"#\")","v":{"$error":"#NAME?"}},3,10,{"$f":"[1]!SUMSTRING(I4:J4,\"#\")","v":{"$error":"#NAME?"}},{"$error":"#NAME?"},0,{"$f":"N3+$N$21/20","v":6534},1960.2,110,{"$f":"_xlfn.IFNA(VLOOKUP(M4,$AE$2:$AF$21,2,0),\"\")","v":""},{"$nulls":3},{"$f":"INT(VLOOKUP(M4,[2]战力等级细化!H:AA,20,FALSE))","v":3390},{"$f":"INT(V3+($V$7-$V$2)/5)","v":1093},null,3,100,5,55590,{"$nulls":3},3,27,29,30,31,32,32,33,34,35,35,36,37,37,38,39,39]
[1041,"简单-1-4",11027,1,{"$f":"[1]!SUMSTRING(C5:D5,\"#\")","v":{"$error":"#NAME?"}},14,100,{"$f":"[1]!SUMSTRING(F5:G5,\"#\")","v":{"$error":"#NAME?"}},3,10,{"$f":"[1]!SUMSTRING(I5:J5,\"#\")","v":{"$error":"#NAME?"}},{"$error":"#NAME?"},0,8712,2613.6,115,"",{"$nulls":3},{"$f":"INT(VLOOKUP(M5,[2]战力等级细化!H:AA,20,FALSE))","v":3390},1136,null,4,100,5,55590,{"$nulls":3},4,29,31,32,33,34,35,36,37,38,38,39,40,41,42,43,43]
[1051,"简单-1-5",11028,1,{"$f":"[1]!SUMSTRING(C6:D6,\"#\")","v":{"$error":"#NAME?"}},14,100,{"$f":"[1]!SUMSTRING(F6:G6,\"#\")","v":{"$error":"#NAME?"}},3,10,{"$f":"[1]!SUMSTRING(I6:J6,\"#\")","v":{"$error":"#NAME?"}},{"$error":"#NAME?"},0,10890,3267,120,"",{"$nulls":3},{"$f":"INT(VLOOKUP(M6,[2]战力等级细化!H:AA,20,FALSE))","v":3390},1179,null,5,108,5,68310,{"$nulls":3},5,31,32,34,35,36,37,38,39,40,41,42,43,44,45,46,46]
[2011,"简单-2-1",11029,1,{"$f":"[1]!SUMSTRING(C7:D7,\"#\")","v":{"$error":"#NAME?"}},14,120,{"$f":"[1]!SUMSTRING(F7:G7,\"#\")","v":{"$error":"#NAME?"}},3,12,{"$f":"[1]!SUMSTRING(I7:J7,\"#\")","v":{"$error":"#NAME?"}},{"$error":"#NAME?"},0.1,13068,3920.4,125,"",{"$nulls":3},{"$f":"INT(VLOOKUP(M7,[2]战力等级细化!H:AA,20,FALSE))","v":2983},1224,null,6,108,5,68310,{"$nulls":3},6,32,34,35,37,38,39,41,42,43,44,45,46,47,47,48,49]
[2021,"简单-2-2",11030,1,{"$f":"[1]!SUMSTRING(C8:D8,\"#\")","v":{"$error":"#NAME?"}},14,120,{"$f":"[1]!SUMSTRING(F8:G8,\"#\")","v":{"$error":"#NAME?"}},3,12,{"$f":"[1]!SUMSTRING(I8:J8,\"#\")","v":{"$error":"#NAME?"}},{"$error":"#NAME?"},0.1,15246,4573.8,130,"",{"$nulls":3},{"$f":"INT(VLOOKUP(M8,[2]战力等级细化!H:AA,20,FALSE))","v":2983},{"$f":"INT(V7+($V$12-$V$7)/5)","v":2769},null,7,120,5,99390,{"$nulls":3},7,34,35,37,38,40,41,43,44,45,46,47,48,49,50,50,51]
[2031,"简单-2-3",11031,1,{"$f":"[1]!SUMSTRING(C9:D9,\"#\")","v":{"$error":"#NAME?"}},14,120,{"$f":"[1]!SUMSTRING(F9:G9,\"#\")","v":{"$error":"#NAME?"}},3,12,{"$f":"[1]!SUMSTRING(I9:J9,\"#\")","v":{"$error":"#NAME?"}},{"$error":"#NAME?"},0.1,17424,5227.2,135,"",{"$nulls":3},{"$f":"INT(VLOOKUP(M9,[2]战力等级细化!H:AA,20,FALSE))","v":2983},{"$f":"INT(V8+($V$12-$V$7)/5)","v":4314},null,8,122,5,105970,{"$nulls":3},8,35,37,38,40,42,43,45,46,47,48,49,50,51,51,52,53]
[2041,"简单-2-4",11032,1,{"$f":"[1]!SUMSTRING(C10:D10,\"#\")","v":{"$error":"#NAME?"}},14,120,{"$f":"[1]!SUMSTRING(F10:G10,\"#\")","v":{"$error":"#NAME?"}},3,12,{"$f":"[1]!SUMSTRING(I10:J10,\"#\")","v":{"$error":"#NAME?"}},{"$error":"#NAME?"},0.1,19602,5880.6,140,"",{"$nulls":3},{"$f":"INT(VLOOKUP(M10,[2]战力等级细化!H:AA,20,FALSE))","v":2983},5859,null,9,124,5,112950,{"$nulls":3},9,36,38,40,42,43,45,46,47,48,50,51,51,52,53,54,55]
[2051,"简单-2-5",11033,1,{"$f":"[1]!SUMSTRING(C11:D11,\"#\")","v":{"$error":"#NAME?"}},14,120,{"$f":"[1]!SUMSTRING(F11:G11,\"#\")","v":{"$error":"#NAME?"}},3,12,{"$f":"[1]!SUMSTRING(I11:J11,\"#\")","v":{"$error":"#NAME?"}},{"$error":"#NAME?"},0.1,21780,6534,145,"",{"$nulls":3},{"$f":"INT(VLOOKUP(M11,[2]战力等级细化!H:AA,20,FALSE))","v":2983},7404,null,10,126,5,120330,{"$nulls":3},10,37,39,41,43,45,46,48,49,50,51,52,53,54,55,55,56]
[3011,"简单-3-1",11034,1,{"$f":"[1]!SUMSTRING(C12:D12,\"#\")","v":{"$error":"#NAME?"}},14,140,{"$f":"[1]!SUMSTRING(F12:G12,\"#\")","v":{"$error":"#NAME?"}},3,14,{"$f":"[1]!SUMSTRING(I12:J12,\"#\")","v":{"$error":"#NAME?"}},{"$error":"#NAME?"},0.3,23958,7187.4,150,"",{"$nulls":3},{"$f":"INT(VLOOKUP(M12,[2]战力等级细化!H:AA,20,FALSE))","v":8949},{"$f":"U12","v":8949},null,11,128,5,128110,{"$nulls":3},11,38,40,43,44,46,48,49,50,51,52,53,54,55,56,57,58]
[3021,"简单-3-2",11035,1,{"$f":"[1]!SUMSTRING(C13:D13,\"#\")","v":{"$error":"#NAME?"}},14,140,{"$f":"[1]!SUMSTRING(F13:G13,\"#\")","v":{"$error":"#NAME?"}},3,14,{"$f":"[1]!SUMSTRING(I13:J13,\"#\")","v":{"$error":"#NAME?"}},{"$error":"#NAME?"},0.35,26136,7840.8,155,"",{"$nulls":3},{"$f":"AVERAGE(U12,U14)","v":10440.5},{"$f":"U13","v":10440.5},null,12,130,5,136290,{"$nulls":3},12,39,42,44,46,47,49,50,51,53,54,55,56,56,57,58,59]
[3031,"简单-3-3",11036,1,{"$f":"[1]!SUMSTRING(C14:D14,\"#\")","v":{"$error":"#NAME?"}},14,140,{"$f":"[1]!SUMSTRING(F14:G14,\"#\")","v":{"$error":"#NAME?"}},3,14,{"$f":"[1]!SUMSTRING(I14:J14,\"#\")","v":{"$error":"#NAME?"}},{"$error":"#NAME?"},0.4,28314,8494.2,160,"",{"$nulls":3},{"$f":"INT(VLOOKUP(M14,[2]战力等级细化!H:AA,20,FALSE))","v":11932},11932,null,13,132,5,144870,{"$nulls":3},13,40,43,45,47,48,50,51,53,54,55,56,57,58,58,59,60]
[3041,"简单-3-4",11037,1,{"$f":"[1]!SUMSTRING(C15:D15,\"#\")","v":{"$error":"#NAME?"}},14,140,{"$f":"[1]!SUMSTRING(F15:G15,\"#\")","v":{"$error":"#NAME?"}},3,14,{"$f":"[1]!SUMSTRING(I15:J15,\"#\")","v":{"$error":"#NAME?"}},{"$error":"#NAME?"},0.45,30492,9147.6,165,"",{"$nulls":3},{"$f":"AVERAGE(U14,U16)","v":13423.5},13423.5,null,14,134,5,153850,{"$nulls":3},14,41,44,46,48,49,51,52,54,55,56,57,58,59,60,60,61]
{"$rows_left_out":167}
{"sheet":"Sheet2","index":2,"n_rows":157,"n_cols":13,"rows_kept":157,"merged":[[4,5,4,6],[4,7,4,8]]}
[null,"Id","Name","Exp","RandomReward",{"$nulls":4},"Show",null,null,"Show"]
[null,"int","string","int","mut,int#int,1",{"$nulls":4},"mut,int#int,2",null,null,"mut,int#int,2"]
[null,2,3,2,4,{"$nulls":4},3,null,null,3]
[null,"关卡ID","关卡名称","关卡经验奖励","关卡道具奖励组\n--每一次",{"$nulls":4},"显示",null,null,"显示"]
["默认值",0," ",0,0,1,null,2,null,"null",null,null,"null"]
["正确性校对"]
["校对值"]
[null,1011,"简单-1-1",8,"4001#3001",{"$f":"VLOOKUP(VALUE(LEFT(VLOOKUP(VALUE(RIGHT(LevelDifficultyConfig!L8,4)),[3]RewardGroup!$B$1:$E$670,4,FALSE),5)),[4]RewardItemConfig!$B$1:$C$1176,2,FALSE)","v":{"$error":"#VALUE!"}},{"$f":"VLOOKUP(VALUE(RIGHT(VLOOKUP(VALUE(RIGHT(LevelDifficultyConfig!L8,4)),[3]RewardGroup!$B$1:$E$670,4,FALSE),5)),[4]RewardItemConfig!$B$1:$C$1176,2,FALSE)","v":{"$error":"#VALUE!"}},{"$f":"VLOOKUP(VALUE(LEFT(VLOOKUP(VALUE(LEFT(LevelDifficultyConfig!L8,4)),[3]RewardGroup!$B$1:$E$670,4,FALSE),5)),[4]RewardItemConfig!$B$1:$C$1176,2,FALSE)","v":3},{"$f":"VLOOKUP(VALUE(RIGHT(VLOOKUP(VALUE(LEFT(LevelDifficultyConfig!L8,4)),[3]RewardGroup!$B$1:$E$670,4,FALSE),5)),[4]RewardItemConfig!$B$1:$C$1176,2,FALSE)","v":14},{"$f":"I8&\"#1|\"&G8&\"#100|\"&F8&\"#10\"","v":{"$error":"#VALUE!"}},null,null,"11024#1|14#100|3#10"]
[null,1021,"简单-1-2",8,"4002#3002",{"$f":"VLOOKUP(VALUE(LEFT(VLOOKUP(VALUE(RIGHT(LevelDifficultyConfig!L9,4)),[3]RewardGroup!$B$1:$E$670,4,FALSE),5)),[4]RewardItemConfig!$B$1:$C$1176,2,FALSE)","v":{"$error":"#VALUE!"}},{"$f":"VLOOKUP(VALUE(RIGHT(VLOOKUP(VALUE(RIGHT(LevelDifficultyConfig!L9,4)),[3]RewardGroup!$B$1:$E$670,4,FALSE),5)),[4]RewardItemConfig!$B$1:$C$1176,2,FALSE)","v":{"$error":"#VALUE!"}},{"$f":"VLOOKUP(VALUE(LEFT(VLOOKUP(VALUE(LEFT(LevelDifficultyConfig!L9,4)),[3]RewardGroup!$B$1:$E$670,4,FALSE),5)),[4]RewardItemConfig!$B$1:$C$1176,2,FALSE)","v":3},{"$f":"VLOOKUP(VALUE(RIGHT(VLOOKUP(VALUE(LEFT(LevelDifficultyConfig!L9,4)),[3]RewardGroup!$B$1:$E$670,4,FALSE),5)),[4]RewardItemConfig!$B$1:$C$1176,2,FALSE)","v":14},{"$f":"I9&\"#1|\"&G9&\"#100|\"&F9&\"#10\"","v":{"$error":"#VALUE!"}},null,null,"11025#1|14#100|3#10"]
[null,1031,"简单-1-3",8,"4003#3003",{"$f":"VLOOKUP(VALUE(LEFT(VLOOKUP(VALUE(RIGHT(LevelDifficultyConfig!L10,4)),[3]RewardGroup!$B$1:$E$670,4,FALSE),5)),[4]RewardItemConfig!$B$1:$C$1176,2,FALSE)","v":{"$error":"#VALUE!"}},{"$f":"VLOOKUP(VALUE(RIGHT(VLOOKUP(VALUE(RIGHT(LevelDifficultyConfig!L10,4)),[3]RewardGroup!$B$1:$E$670,4,FALSE),5)),[4]RewardItemConfig!$B$1:$C$1176,2,FALSE)","v":{"$error":"#VALUE!"}},{"$f":"VLOOKUP(VALUE(LEFT(VLOOKUP(VALUE(LEFT(LevelDifficultyConfig!L10,4)),[3]RewardGroup!$B$1:$E$670,4,FALSE),5)),[4]RewardItemConfig!$B$1:$C$1176,2,FALSE)","v":3},{"$f":"VLOOKUP(VALUE(RIGHT(VLOOKUP(VALUE(LEFT(LevelDifficultyConfig!L10,4)),[3]RewardGroup!$B$1:$E$670,4,FALSE),5)),[4]RewardItemConfig!$B$1:$C$1176,2,FALSE)","v":14},{"$error":"#VALUE!"},null,null,"11026#1|14#100|3#10"]
[null,1041,"简单-1-4",8,"4004#3004",{"$f":"VLOOKUP(VALUE(LEFT(VLOOKUP(VALUE(RIGHT(LevelDifficultyConfig!L11,4)),[3]RewardGroup!$B$1:$E$670,4,FALSE),5)),[4]RewardItemConfig!$B$1:$C$1176,2,FALSE)","v":{"$error":"#VALUE!"}},{"$f":"VLOOKUP(VALUE(RIGHT(VLOOKUP(VALUE(RIGHT(LevelDifficultyConfig!L11,4)),[3]RewardGroup!$B$1:$E$670,4,FALSE),5)),[4]RewardItemConfig!$B$1:$C$1176,2,FALSE)","v":{"$error":"#VALUE!"}},{"$f":"VLOOKUP(VALUE(LEFT(VLOOKUP(VALUE(LEFT(LevelDifficultyConfig!L11,4)),[3]RewardGroup!$B$1:$E$670,4,FALSE),5)),[4]RewardItemConfig!$B$1:$C$1176,2,FALSE)","v":3},{"$f":"VLOOKUP(VALUE(RIGHT(VLOOKUP(VALUE(LEFT(LevelDifficultyConfig!L11,4)),[3]RewardGroup!$B$1:$E$670,4,FALSE),5)),[4]RewardItemConfig!$B$1:$C$1176,2,FALSE)","v":14},{"$error":"#VALUE!"},null,null,"11027#1|14#100|3#10"]
[null,1051,"简单-1-5",8,"4005#3005",{"$f":"VLOOKUP(VALUE(LEFT(VLOOKUP(VALUE(RIGHT(LevelDifficultyConfig!L12,4)),[3]RewardGroup!$B$1:$E$670,4,FALSE),5)),[4]RewardItemConfig!$B$1:$C$1176,2,FALSE)","v":{"$error":"#VALUE!"}},{"$f":"VLOOKUP(VALUE(RIGHT(VLOOKUP(VALUE(RIGHT(LevelDifficultyConfig!L12,4)),[3]RewardGroup!$B$1:$E$670,4,FALSE),5)),[4]RewardItemConfig!$B$1:$C$1176,2,FALSE)","v":{"$error":"#VALUE!"}},{"$f":"VLOOKUP(VALUE(LEFT(VLOOKUP(VALUE(LEFT(LevelDifficultyConfig!L12,4)),[3]RewardGroup!$B$1:$E$670,4,FALSE),5)),[4]RewardItemConfig!$B$1:$C$1176,2,FALSE)","v":3},{"$f":"VLOOKUP(VALUE(RIGHT(VLOOKUP(VALUE(LEFT(LevelDifficultyConfig!L12,4)),[3]RewardGroup!$B$1:$E$670,4,FALSE),5)),[4]RewardItemConfig!$B$1:$C$1176,2,FALSE)","v":14},{"$error":"#VALUE!"},null,null,"11028#1|14#100|3#10"]
[null,2011,"简单-2-1",8,"4006#3006",{"$f":"VLOOKUP(VALUE(LEFT(VLOOKUP(VALUE(RIGHT(LevelDifficultyConfig!L13,4)),[3]RewardGroup!$B$1:$E$670,4,FALSE),5)),[4]RewardItemConfig!$B$1:$C$1176,2,FALSE)","v":{"$error":"#VALUE!"}},{"$f":"VLOOKUP(VALUE(RIGHT(VLOOKUP(VALUE(RIGHT(LevelDifficultyConfig!L13,4)),[3]RewardGroup!$B$1:$E$670,4,FALSE),5)),[4]RewardItemConfig!$B$1:$C$1176,2,FALSE)","v":{"$error":"#VALUE!"}},{"$f":"VLOOKUP(VALUE(LEFT(VLOOKUP(VALUE(LEFT(LevelDifficultyConfig!L13,4)),[3]RewardGroup!$B$1:$E$670,4,FALSE),5)),[4]RewardItemConfig!$B$1:$C$1176,2,FALSE)","v":3},{"$f":"VLOOKUP(VALUE(RIGHT(VLOOKUP(VALUE(LEFT(LevelDifficultyConfig!L13,4)),[3]RewardGroup!$B$1:$E$670,4,FALSE),5)),[4]RewardItemConfig!$B$1:$C$1176,2,FALSE)","v":14},{"$f":"I13&\"#1|\"&G13&\"#120|\"&F13&\"#12\"","v":{"$error":"#VALUE!"}},null,null,"11029#1|14#120|3#12"]
[null,2021,"简单-2-2",8,"4007#3007",{"$f":"VLOOKUP(VALUE(LEFT(VLOOKUP(VALUE(RIGHT(LevelDifficultyConfig!L14,4)),[3]RewardGroup!$B$1:$E$670,4,FALSE),5)),[4]RewardItemConfig!$B$1:$C$1176,2,FALSE)","v":{"$error":"#VALUE!"}},{"$f":"VLOOKUP(VALUE(RIGHT(VLOOKUP(VALUE(RIGHT(LevelDifficultyConfig!L14,4)),[3]RewardGroup!$B$1:$E$670,4,FALSE),5)),[4]RewardItemConfig!$B$1:$C$1176,2,FALSE)","v":{"$error":"#VALUE!"}},{"$f":"VLOOKUP(VALUE(LEFT(VLOOKUP(VALUE(LEFT(LevelDifficultyConfig!L14,4)),[3]RewardGroup!$B$1:$E$670,4,FALSE),5)),[4]RewardItemConfig!$B$1:$C$1176,2,FALSE)","v":3},{"$f":"VLOOKUP(VALUE(RIGHT(VLOOKUP(VALUE(LEFT(LevelDifficultyConfig!L14,4)),[3]RewardGroup!$B$1:$E$670,4,FALSE),5)),[4]RewardItemConfig!$B$1:$C$1176,2,FALSE)","v":14},{"$f":"I14&\"#1|\"&G14&\"#120|\"&F14&\"#12\"","v":{"$error":"#VALUE!"}},null,null,"11030#1|14#120|3#12"]
[null,2031,"简单-2-3",8,"4008#3008",{"$f":"VLOOKUP(VALUE(LEFT(VLOOKUP(VALUE(RIGHT(LevelDifficultyConfig!L15,4)),[3]RewardGroup!$B$1:$E$670,4,FALSE),5)),[4]RewardItemConfig!$B$1:$C$1176,2,FALSE)","v":{"$error":"#VALUE!"}},{"$f":"VLOOKUP(VALUE(RIGHT(VLOOKUP(VALUE(RIGHT(LevelDifficultyConfig!L15,4)),[3]RewardGroup!$B$1:$E$670,4,FALSE),5)),[4]RewardItemConfig!$B$1:$C$1176,2,FALSE)","v":{"$error":"#VALUE!"}},{"$f":"VLOOKUP(VALUE(LEFT(VLOOKUP(VALUE(LEFT(LevelDifficultyConfig!L15,4)),[3]RewardGroup!$B$1:$E$670,4,FALSE),5)),[4]RewardItemConfig!$B$1:$C$1176,2,FALSE)","v":3},{"$f":"VLOOKUP(VALUE(RIGHT(VLOOKUP(VALUE(LEFT(LevelDifficultyConfig!L15,4)),[3]RewardGroup!$B$1:$E$670,4,FALSE),5)),[4]RewardItemConfig!$B$1:$C$1176,2,FALSE)","v":14},{"$error":"#VALUE!"},null,null,"11031#1|14#120|3#12"]
{"$rows_left_out":143}
{"sheet":"Sheet3","index":3,"n_rows":71,"n_cols":16,"rows_kept":71}
[]
[]
[]
[]
[]
[]
[{"$nulls":6},5011]
[{"$nulls":6},5012]
[{"$nulls":6},5013]
[{"$nulls":6},5014]
[{"$nulls":6},5015]
[{"$nulls":6},5016]
[{"$nulls":6},5017]
[{"$nulls":6},5018]
[{"$nulls":6},5019]
{"$rows_left_out":57}
{"sheet":"Sheet4","index":4,"n_rows":302,"n_cols":21,"rows_kept":302}
[]
[{"$nulls":18},"#1","#1"]
[{"$nulls":4},"简单-1-1","70101#1","14#100","3#10",{"$nulls":5},610101,null,null,{"$f":"VLOOKUP(N3,[4]RewardItemConfig!$B:$C,2,FALSE)","v":70101},{"$f":"IF(VLOOKUP(O3,[4]RewardItemConfig!$B:$C,2,FALSE)=0,\"\",VLOOKUP(O3,[4]RewardItemConfig!$B:$C,2,FALSE))","v":""},{"$f":"IF(Q3=\"\",\"\",Q3&$S$2)","v":"70101#1"},{"$f":"IF(R3=\"\",\"\",R3&$S$2)","v":""},{"$f":"_xlfn.TEXTJOIN(\"|\",TRUE,S3:T3,G3,H3)","v":"70101#1|14#100|3#10"}]
[8801,401226,{"$f":"A4&\"#\"&B4","v":"8801#401226"},null,"简单-1-2","70201#1","14#100","3#10",{"$nulls":5},610201,null,null,{"$f":"VLOOKUP(N4,[4]RewardItemConfig!$B:$C,2,FALSE)","v":70201},{"$f":"IF(VLOOKUP(O4,[4]RewardItemConfig!$B:$C,2,FALSE)=0,\"\",VLOOKUP(O4,[4]RewardItemConfig!$B:$C,2,FALSE))","v":""},{"$f":"IF(Q4=\"\",\"\",Q4&$S$2)","v":"70201#1"},{"$f":"IF(R4=\"\",\"\",R4&$S$2)","v":""},{"$f":"_xlfn.TEXTJOIN(\"|\",TRUE,S4:T4,G4,H4)","v":"70201#1|14#100|3#10"}]
[8802,401227,{"$f":"A5&\"#\"&B5","v":"8802#401227"},null,"简单-1-3","70301#1","14#100","3#10",{"$nulls":5},610301,null,null,{"$f":"VLOOKUP(N5,[4]RewardItemConfig!$B:$C,2,FALSE)","v":70301},{"$f":"IF(VLOOKUP(O5,[4]RewardItemConfig!$B:$C,2,FALSE)=0,\"\",VLOOKUP(O5,[4]RewardItemConfig!$B:$C,2,FALSE))","v":""},"70301#1","","70301#1|14#100|3#10"]
[8803,401228,"8803#401228",null,"简单-1-4","70401#1","14#100","3#10",{"$nulls":5},610401,null,null,{"$f":"VLOOKUP(N6,[4]RewardItemConfig!$B:$C,2,FALSE)","v":70401},{"$f":"IF(VLOOKUP(O6,[4]RewardItemConfig!$B:$C,2,FALSE)=0,\"\",VLOOKUP(O6,[4]RewardItemConfig!$B:$C,2,FALSE))","v":""},"70401#1","","70401#1|14#100|3#10"]
[8804,401229,"8804#401229",null,"简单-1-5","70501#1","14#100","3#10",{"$nulls":5},610501,null,null,{"$f":"VLOOKUP(N7,[4]RewardItemConfig!$B:$C,2,FALSE)","v":70501},{"$f":"IF(VLOOKUP(O7,[4]RewardItemConfig!$B:$C,2,FALSE)=0,\"\",VLOOKUP(O7,[4]RewardItemConfig!$B:$C,2,FALSE))","v":""},"70501#1","","70501#1|14#100|3#10"]
[8805,401230,"8805#401230",null,"简单-2-1","70102#1","14#120","3#12",{"$nulls":5},610102,null,null,{"$f":"VLOOKUP(N8,[4]RewardItemConfig!$B:$C,2,FALSE)","v":70102},{"$f":"IF(VLOOKUP(O8,[4]RewardItemConfig!$B:$C,2,FALSE)=0,\"\",VLOOKUP(O8,[4]RewardItemConfig!$B:$C,2,FALSE))","v":""},"70102#1","","70102#1|14#120|3#12"]
[8806,401231,"8806#401231",null,"简单-2-2","70202#1","14#120","3#12",{"$nulls":5},610202,null,null,{"$f":"VLOOKUP(N9,[4]RewardItemConfig!$B:$C,2,FALSE)","v":70202},{"$f":"IF(VLOOKUP(O9,[4]RewardItemConfig!$B:$C,2,FALSE)=0,\"\",VLOOKUP(O9,[4]RewardItemConfig!$B:$C,2,FALSE))","v":""},"70202#1","","70202#1|14#120|3#12"]
[8807,401232,"8807#401232",null,"简单-2-3","70302#1","14#120","3#12",{"$nulls":5},610302,null,null,{"$f":"VLOOKUP(N10,[4]RewardItemConfig!$B:$C,2,FALSE)","v":70302},{"$f":"IF(VLOOKUP(O10,[4]RewardItemConfig!$B:$C,2,FALSE)=0,\"\",VLOOKUP(O10,[4]RewardItemConfig!$B:$C,2,FALSE))","v":""},"70302#1","","70302#1|14#120|3#12"]
[8808,401233,"8808#401233",null,"简单-2-4","70402#1","14#120","3#12",{"$nulls":5},610402,null,null,{"$f":"VLOOKUP(N11,[4]RewardItemConfig!$B:$C,2,FALSE)","v":70402},{"$f":"IF(VLOOKUP(O11,[4]RewardItemConfig!$B:$C,2,FALSE)=0,\"\",VLOOKUP(O11,[4]RewardItemConfig!$B:$C,2,FALSE))","v":""},"70402#1","","70402#1|14#120|3#12"]
[8809,401234,"8809#401234",null,"简单-2-5","70502#1","14#120","3#12",{"$nulls":5},610502,null,null,{"$f":"VLOOKUP(N12,[4]RewardItemConfig!$B:$C,2,FALSE)","v":70502},{"$f":"IF(VLOOKUP(O12,[4]RewardItemConfig!$B:$C,2,FALSE)=0,\"\",VLOOKUP(O12,[4]RewardItemConfig!$B:$C,2,FALSE))","v":""},"70502#1","","70502#1|14#120|3#12"]
[8810,401235,"8810#401235",null,"简单-3-1","70103#1","14#140","3#14",{"$nulls":5},610103,null,null,{"$f":"VLOOKUP(N13,[4]RewardItemConfig!$B:$C,2,FALSE)","v":70103},{"$f":"IF(VLOOKUP(O13,[4]RewardItemConfig!$B:$C,2,FALSE)=0,\"\",VLOOKUP(O13,[4]RewardItemConfig!$B:$C,2,FALSE))","v":""},"70103#1","","70103#1|14#140|3#14"]
[8811,401236,"8811#401236",null,"简单-3-2","70203#1","14#140","3#14",{"$nulls":5},610203,null,null,{"$f":"VLOOKUP(N14,[4]RewardItemConfig!$B:$C,2,FALSE)","v":70203},{"$f":"IF(VLOOKUP(O14,[4]RewardItemConfig!$B:$C,2,FALSE)=0,\"\",VLOOKUP(O14,[4]RewardItemConfig!$B:$C,2,FALSE))","v":""},"70203#1","","70203#1|14#140|3#14"]
[8812,401237,"8812#401237",null,"简单-3-3","70303#1","14#140","3#14",{"$nulls":5},610303,null,null,{"$f":"VLOOKUP(N15,[4]RewardItemConfig!$B:$C,2,FALSE)","v":70303},{"$f":"IF(VLOOKUP(O15,[4]RewardItemConfig!$B:$C,2,FALSE)=0,\"\",VLOOKUP(O15,[4]RewardItemConfig!$B:$C,2,FALSE))","v":""},"70303#1","","70303#1|14#140|3#14"]
{"$rows_left_out":287}