{"text_format":"3","workbook":"xlsx","n_sheets":4,"sheets":["MapPointConfig","Sheet1","Sheet2","事件点刷新规则"],"not_rendered":{"images":23,"comments":1},"read":"whole","date_system":"1900"}

{"sheet":"MapPointConfig","index":0,"n_rows":2632,"n_cols":12,"rows_kept":2632}
[null,"Id","Style","Desc","Icon","Refresh","TriggerRules","InitialEventId","isHidden","EventPointBg","RandomProbability","IsShowFightAbility"]
[null,"int","int","string","int","int","int","int","int","string","mut,int#int,2","mut,int#int,1"]
[null,2,2,3,3,4,2,4,3,3,4,4]
[null,"唯一id，id规则：\n首位代表玩法内容：1探索 2副本 3爬塔\n2,3位代表地图编号\n最后两位代表事件点","事件点类型\n(1怪 2矿 3出生点 4传送门 5连续事件 6行脚商人 7宝箱 8阻挡点 9试炼buff 10门（桥)）11银英怪\n12血战专用矿\n ","事件点描述","事件点图标","事件点的刷新规则\n1每日刷新\n2探索刷新\n3一次性\n4时间刷新","事件点触发规则\n1边缘触发 \n2覆盖触发\n3点击触发","初始关联事件id","初始关联图标状态\n1、始终显示\n2、触发显示\n3、永不显示","事件点背景图","事件点出现概率","需要显示的战力"]
["默认值",0,0,{"$f":"\"\"","v":""},{"$f":"\"\"","v":""},0,0,0,1,{"$f":"\"\"","v":""},"null","null"]
["正确性校对"]
["校对值"]
[null,1,5,"关卡显示用",1]
[null,2,5,"关卡显示用",2]
[null,3,5,"关卡显示用",6]
[null,4,5,"关卡显示用",7]
[null,5,5,"关卡显示用",8]
[null,6,5,"关卡显示用",10]
[null,7,5,"关卡显示用",11]
[null,8,5,"关卡显示用",13]
[null,9,5,"关卡显示用",17]
[null,10,5,"关卡显示用",14]
[null,11,5,"关卡显示用",15]
[null,12,5,"关卡显示用",3]
[]
[null,12001,12,"大矿"]
[null,12002,12,"小矿"]
[]
[null,100001,4,"战乱荒林",5,2,2,100001]
[null,100002,5,"初遇",7,2,2,100002]
[null,100003,5,"序章初入",7,3,2,100019]
[null,100004,1,"序章怪物",1,2,1,100010]
[null,100005,5,"测试用点1",7,3,2,100014]
[null,100006,5,"测试用点2",7,3,2,100015]
[null,100007,5,"剧情点",7,3,2,100040]
{"$rows_left_out":2603}
{"sheet":"Sheet1","index":1,"n_rows":200,"n_cols":27,"rows_kept":200}
["2001001#100","2001002#100","2001003#100","2001004#100","2001005#100","2001006#100","2001007#100","2001008#100",null,null,{"$f":"--LEFT(A1,FIND(\"#\",A1,1)-1)","v":2001001},{"$f":"--LEFT(B1,FIND(\"#\",B1,1)-1)","v":2001002},2001003,2001004,2001005,2001006,2001007,2001008,null,{"$f":"VLOOKUP(K1,MapPointConfig!$B$833:$H$1732,7,FALSE)","v":2001001},{"$f":"VLOOKUP(L1,MapPointConfig!$B$833:$H$1732,7,FALSE)","v":2001002},{"$f":"VLOOKUP(M1,MapPointConfig!$B$833:$H$1732,7,FALSE)","v":2001003},{"$f":"VLOOKUP(N1,MapPointConfig!$B$833:$H$1732,7,FALSE)","v":2001004},{"$f":"VLOOKUP(O1,MapPointConfig!$B$833:$H$1732,7,FALSE)","v":2001005},{"$f":"VLOOKUP(P1,MapPointConfig!$B$833:$H$1732,7,FALSE)","v":2001006},{"$f":"VLOOKUP(Q1,MapPointConfig!$B$833:$H$1732,7,FALSE)","v":2001007},{"$f":"VLOOKUP(R1,MapPointConfig!$B$833:$H$1732,7,FALSE)","v":2001008}]
["2002001#100","2002002#100","2002003#100","2002004#100","2002005#100","2002006#100","2002007#100","2002008#100",null,null,{"$f":"--LEFT(A2,FIND(\"#\",A2,1)-1)","v":2002001},{"$f":"--LEFT(B2,FIND(\"#\",B2,1)-1)","v":2002002},{"$f":"--LEFT(C2,FIND(\"#\",C2,1)-1)","v":2002003},{"$f":"--LEFT(D2,FIND(\"#\",D2,1)-1)","v":2002004},{"$f":"--LEFT(E2,FIND(\"#\",E2,1)-1)","v":2002005},{"$f":"--LEFT(F2,FIND(\"#\",F2,1)-1)","v":2002006},{"$f":"--LEFT(G2,FIND(\"#\",G2,1)-1)","v":2002007},{"$f":"--LEFT(H2,FIND(\"#\",H2,1)-1)","v":2002008},null,{"$f":"VLOOKUP(K2,MapPointConfig!$B$833:$H$1732,7,FALSE)","v":2002001},{"$f":"VLOOKUP(L2,MapPointConfig!$B$833:$H$1732,7,FALSE)","v":2002002},{"$f":"VLOOKUP(M2,MapPointConfig!$B$833:$H$1732,7,FALSE)","v":2002003},{"$f":"VLOOKUP(N2,MapPointConfig!$B$833:$H$1732,7,FALSE)","v":2002004},{"$f":"VLOOKUP(O2,MapPointConfig!$B$833:$H$1732,7,FALSE)","v":2002005},{"$f":"VLOOKUP(P2,MapPointConfig!$B$833:$H$1732,7,FALSE)","v":2002006},{"$f":"VLOOKUP(Q2,MapPointConfig!$B$833:$H$1732,7,FALSE)","v":2002007},{"$f":"VLOOKUP(R2,MapPointConfig!$B$833:$H$1732,7,FALSE)","v":2002008}]
["2003001#100","2003002#100","2003003#100","2003004#100","2003005#100","2003006#100","2003007#100","2003008#100",null,null,2003001,2003002,2003003,2003004,2003005,2003006,2003007,2003008,null,{"$f":"VLOOKUP(K3,MapPointConfig!$B$833:$H$1732,7,FALSE)","v":2003001},{"$f":"VLOOKUP(L3,MapPointConfig!$B$833:$H$1732,7,FALSE)","v":2003002},{"$f":"VLOOKUP(M3,MapPointConfig!$B$833:$H$1732,7,FALSE)","v":2003003},{"$f":"VLOOKUP(N3,MapPointConfig!$B$833:$H$1732,7,FALSE)","v":2003004},{"$f":"VLOOKUP(O3,MapPointConfig!$B$833:$H$1732,7,FALSE)","v":2003005},{"$f":"VLOOKUP(P3,MapPointConfig!$B$833:$H$1732,7,FALSE)","v":2003006},{"$f":"VLOOKUP(Q3,MapPointConfig!$B$833:$H$1732,7,FALSE)","v":2003007},{"$f":"VLOOKUP(R3,MapPointConfig!$B$833:$H$1732,7,FALSE)","v":2003008}]
["2004001#100","2004002#100","2004003#100","2004004#100","2004005#100","2004006#100","2004007#100","2004008#100",null,null,2004001,2004002,2004003,2004004,2004005,2004006,2004007,2004008,null,{"$f":"VLOOKUP(K4,MapPointConfig!$B$833:$H$1732,7,FALSE)","v":2004001},{"$f":"VLOOKUP(L4,MapPointConfig!$B$833:$H$1732,7,FALSE)","v":2004002},{"$f":"VLOOKUP(M4,MapPointConfig!$B$833:$H$1732,7,FALSE)","v":2004003},{"$f":"VLOOKUP(N4,MapPointConfig!$B$833:$H$1732,7,FALSE)","v":2004004},{"$f":"VLOOKUP(O4,MapPointConfig!$B$833:$H$1732,7,FALSE)","v":2004005},{"$f":"VLOOKUP(P4,MapPointConfig!$B$833:$H$1732,7,FALSE)","v":2004006},{"$f":"VLOOKUP(Q4,MapPointConfig!$B$833:$H$1732,7,FALSE)","v":2004007},{"$f":"VLOOKUP(R4,MapPointConfig!$B$833:$H$1732,7,FALSE)","v":2004008}]
["2005001#100","2005002#100","2005003#100","2005004#100","2005005#100","2005006#100","2005007#100","2005008#100",null,null,2005001,2005002,2005003,2005004,2005005,2005006,2005007,2005008,null,{"$f":"VLOOKUP(K5,MapPointConfig!$B$833:$H$1732,7,FALSE)","v":2005001},{"$f":"VLOOKUP(L5,MapPointConfig!$B$833:$H$1732,7,FALSE)","v":2005002},{"$f":"VLOOKUP(M5,MapPointConfig!$B$833:$H$1732,7,FALSE)","v":2005003},{"$f":"VLOOKUP(N5,MapPointConfig!$B$833:$H$1732,7,FALSE)","v":2005004},{"$f":"VLOOKUP(O5,MapPointConfig!$B$833:$H$1732,7,FALSE)","v":2005005},{"$f":"VLOOKUP(P5,MapPointConfig!$B$833:$H$1732,7,FALSE)","v":2005006},{"$f":"VLOOKUP(Q5,MapPointConfig!$B$833:$H$1732,7,FALSE)","v":2005007},{"$f":"VLOOKUP(R5,MapPointConfig!$B$833:$H$1732,7,FALSE)","v":2005008}]
["2006001#100","2006002#100","2006003#100","2006004#100","2006005#100","2006006#100","2006007#100","2006008#100",null,null,2006001,2006002,2006003,2006004,2006005,2006006,2006007,2006008,null,{"$f":"VLOOKUP(K6,MapPointConfig!$B$833:$H$1732,7,FALSE)","v":2006001},{"$f":"VLOOKUP(L6,MapPointConfig!$B$833:$H$1732,7,FALSE)","v":2006002},{"$f":"VLOOKUP(M6,MapPointConfig!$B$833:$H$1732,7,FALSE)","v":2006003},{"$f":"VLOOKUP(N6,MapPointConfig!$B$833:$H$1732,7,FALSE)","v":2006004},{"$f":"VLOOKUP(O6,MapPointConfig!$B$833:$H$1732,7,FALSE)","v":2006005},{"$f":"VLOOKUP(P6,MapPointConfig!$B$833:$H$1732,7,FALSE)","v":2006006},{"$f":"VLOOKUP(Q6,MapPointConfig!$B$833:$H$1732,7,FALSE)","v":2006007},{"$f":"VLOOKUP(R6,MapPointConfig!$B$833:$H$1732,7,FALSE)","v":2006008}]
["2007001#100","2007002#100","2007003#100","2007004#100","2007005#100","2007006#100","2007007#100","2007008#100",null,null,2007001,2007002,2007003,2007004,2007005,2007006,2007007,2007008,null,{"$f":"VLOOKUP(K7,MapPointConfig!$B$833:$H$1732,7,FALSE)","v":2007001},{"$f":"VLOOKUP(L7,MapPointConfig!$B$833:$H$1732,7,FALSE)","v":2007002},{"$f":"VLOOKUP(M7,MapPointConfig!$B$833:$H$1732,7,FALSE)","v":2007003},{"$f":"VLOOKUP(N7,MapPointConfig!$B$833:$H$1732,7,FALSE)","v":2007004},{"$f":"VLOOKUP(O7,MapPointConfig!$B$833:$H$1732,7,FALSE)","v":2007005},{"$f":"VLOOKUP(P7,MapPointConfig!$B$833:$H$1732,7,FALSE)","v":2007006},{"$f":"VLOOKUP(Q7,MapPointConfig!$B$833:$H$1732,7,FALSE)","v":2007007},{"$f":"VLOOKUP(R7,MapPointConfig!$B$833:$H$1732,7,FALSE)","v":2007008}]
["2008001#100","2008002#100","2008003#100","2008004#100","2008005#100","2008006#100","2008007#100","2008008#100",null,null,2008001,2008002,2008003,2008004,2008005,2008006,2008007,2008008,null,{"$f":"VLOOKUP(K8,MapPointConfig!$B$833:$H$1732,7,FALSE)","v":2008001},{"$f":"VLOOKUP(L8,MapPointConfig!$B$833:$H$1732,7,FALSE)","v":2008002},{"$f":"VLOOKUP(M8,MapPointConfig!$B$833:$H$1732,7,FALSE)","v":2008003},{"$f":"VLOOKUP(N8,MapPointConfig!$B$833:$H$1732,7,FALSE)","v":2008004},{"$f":"VLOOKUP(O8,MapPointConfig!$B$833:$H$1732,7,FALSE)","v":2008005},{"$f":"VLOOKUP(P8,MapPointConfig!$B$833:$H$1732,7,FALSE)","v":2008006},{"$f":"VLOOKUP(Q8,MapPointConfig!$B$833:$H$1732,7,FALSE)","v":2008007},{"$f":"VLOOKUP(R8,MapPointConfig!$B$833:$H$1732,7,FALSE)","v":2008008}]
["2009001#100","2009002#100","2009003#100","2009004#100","2009005#100","2009006#100","2009007#100","2009008#100",null,null,2009001,2009002,2009003,2009004,2009005,2009006,2009007,2009008,null,{"$f":"VLOOKUP(K9,MapPointConfig!$B$833:$H$1732,7,FALSE)","v":2009001},{"$f":"VLOOKUP(L9,MapPointConfig!$B$833:$H$1732,7,FALSE)","v":2009002},{"$f":"VLOOKUP(M9,MapPointConfig!$B$833:$H$1732,7,FALSE)","v":2009003},{"$f":"VLOOKUP(N9,MapPointConfig!$B$833:$H$1732,7,FALSE)","v":2009004},{"$f":"VLOOKUP(O9,MapPointConfig!$B$833:$H$1732,7,FALSE)","v":2009005},{"$f":"VLOOKUP(P9,MapPointConfig!$B$833:$H$1732,7,FALSE)","v":2009006},{"$f":"VLOOKUP(Q9,MapPointConfig!$B$833:$H$1732,7,FALSE)","v":2009007},{"$f":"VLOOKUP(R9,MapPointConfig!$B$833:$H$1732,7,FALSE)","v":2009008}]
["2010001#100","2010002#100","2010003#100","2010004#100","2010005#100","2010006#100","2010007#100","2010008#100",null,null,2010001,2010002,2010003,2010004,2010005,2010006,2010007,2010008,null,{"$f":"VLOOKUP(K10,MapPointConfig!$B$833:$H$1732,7,FALSE)","v":2010001},{"$f":"VLOOKUP(L10,MapPointConfig!$B$833:$H$1732,7,FALSE)","v":2010002},{"$f":"VLOOKUP(M10,MapPointConfig!$B$833:$H$1732,7,FALSE)","v":2010003},{"$f":"VLOOKUP(N10,MapPointConfig!$B$833:$H$1732,7,FALSE)","v":2010004},{"$f":"VLOOKUP(O10,MapPointConfig!$B$833:$H$1732,7,FALSE)","v":2010005},{"$f":"VLOOKUP(P10,MapPointConfig!$B$833:$H$1732,7,FALSE)","v":2010006},{"$f":"VLOOKUP(Q10,MapPointConfig!$B$833:$H$1732,7,FALSE)","v":2010007},{"$f":"VLOOKUP(R10,MapPointConfig!$B$833:$H$1732,7,FALSE)","v":2010008}]
["2011001#100","2011002#100","2011003#100","2011004#100","2011005#100","2011006#100","2011007#100","2011008#100",null,null,2011001,2011002,2011003,2011004,2011005,2011006,2011007,2011008,null,{"$f":"VLOOKUP(K11,MapPointConfig!$B$833:$H$1732,7,FALSE)","v":2011001},{"$f":"VLOOKUP(L11,MapPointConfig!$B$833:$H$1732,7,FALSE)","v":2011002},{"$f":"VLOOKUP(M11,MapPointConfig!$B$833:$H$1732,7,FALSE)","v":2011003},{"$f":"VLOOKUP(N11,MapPointConfig!$B$833:$H$1732,7,FALSE)","v":2011004},{"$f":"VLOOKUP(O11,MapPointConfig!$B$833:$H$1732,7,FALSE)","v":2011005},{"$f":"VLOOKUP(P11,MapPointConfig!$B$833:$H$1732,7,FALSE)","v":2011006},{"$f":"VLOOKUP(Q11,MapPointConfig!$B$833:$H$1732,7,FALSE)","v":2011007},{"$f":"VLOOKUP(R11,MapPointConfig!$B$833:$H$1732,7,FALSE)","v":2011008}]
["2012001#100","2012002#100","2012003#100","2012004#100","2012005#100","2012006#100","2012007#100","2012008#100",null,null,2012001,2012002,2012003,2012004,2012005,2012006,2012007,2012008,null,{"$f":"VLOOKUP(K12,MapPointConfig!$B$833:$H$1732,7,FALSE)","v":2012001},{"$f":"VLOOKUP(L12,MapPointConfig!$B$833:$H$1732,7,FALSE)","v":2012002},{"$f":"VLOOKUP(M12,MapPointConfig!$B$833:$H$1732,7,FALSE)","v":2012003},{"$f":"VLOOKUP(N12,MapPointConfig!$B$833:$H$1732,7,FALSE)","v":2012004},{"$f":"VLOOKUP(O12,MapPointConfig!$B$833:$H$1732,7,FALSE)","v":2012005},{"$f":"VLOOKUP(P12,MapPointConfig!$B$833:$H$1732,7,FALSE)","v":2012006},{"$f":"VLOOKUP(Q12,MapPointConfig!$B$833:$H$1732,7,FALSE)","v":2012007},{"$f":"VLOOKUP(R12,MapPointConfig!$B$833:$H$1732,7,FALSE)","v":2012008}]
["2013001#100","2013002#100","2013003#100","2013004#100","2013005#100","2013006#100","2013007#100","2013008#100",null,null,2013001,2013002,2013003,2013004,2013005,2013006,2013007,2013008,null,{"$f":"VLOOKUP(K13,MapPointConfig!$B$833:$H$1732,7,FALSE)","v":2013001},{"$f":"VLOOKUP(L13,MapPointConfig!$B$833:$H$1732,7,FALSE)","v":2013002},{"$f":"VLOOKUP(M13,MapPointConfig!$B$833:$H$1732,7,FALSE)","v":2013003},{"$f":"VLOOKUP(N13,MapPointConfig!$B$833:$H$1732,7,FALSE)","v":2013004},{"$f":"VLOOKUP(O13,MapPointConfig!$B$833:$H$1732,7,FALSE)","v":2013005},{"$f":"VLOOKUP(P13,MapPointConfig!$B$833:$H$1732,7,FALSE)","v":2013006},{"$f":"VLOOKUP(Q13,MapPointConfig!$B$833:$H$1732,7,FALSE)","v":2013007},{"$f":"VLOOKUP(R13,MapPointConfig!$B$833:$H$1732,7,FALSE)","v":2013008}]
["2014001#100","2014002#100","2014003#100","2014004#100","2014005#100","2014006#100","2014007#100","2014008#100",null,null,2014001,2014002,2014003,2014004,2014005,2014006,2014007,2014008,null,{"$f":"VLOOKUP(K14,MapPointConfig!$B$833:$H$1732,7,FALSE)","v":2014001},{"$f":"VLOOKUP(L14,MapPointConfig!$B$833:$H$1732,7,FALSE)","v":2014002},{"$f":"VLOOKUP(M14,MapPointConfig!$B$833:$H$1732,7,FALSE)","v":2014003},{"$f":"VLOOKUP(N14,MapPointConfig!$B$833:$H$1732,7,FALSE)","v":2014004},{"$f":"VLOOKUP(O14,MapPointConfig!$B$833:$H$1732,7,FALSE)","v":2014005},{"$f":"VLOOKUP(P14,MapPointConfig!$B$833:$H$1732,7,FALSE)","v":2014006},{"$f":"VLOOKUP(Q14,MapPointConfig!$B$833:$H$1732,7,FALSE)","v":2014007},{"$f":"VLOOKUP(R14,MapPointConfig!$B$833:$H$1732,7,FALSE)","v":2014008}]
["2015001#100","2015002#100","2015003#100","2015004#100","2015005#100","2015006#100","2015007#100","2015008#100",null,null,2015001,2015002,2015003,2015004,2015005,2015006,2015007,2015008,null,{"$f":"VLOOKUP(K15,MapPointConfig!$B$833:$H$1732,7,FALSE)","v":2015001},{"$f":"VLOOKUP(L15,MapPointConfig!$B$833:$H$1732,7,FALSE)","v":2015002},{"$f":"VLOOKUP(M15,MapPointConfig!$B$833:$H$1732,7,FALSE)","v":2015003},{"$f":"VLOOKUP(N15,MapPointConfig!$B$833:$H$1732,7,FALSE)","v":2015004},{"$f":"VLOOKUP(O15,MapPointConfig!$B$833:$H$1732,7,FALSE)","v":2015005},{"$f":"VLOOKUP(P15,MapPointConfig!$B$833:$H$1732,7,FALSE)","v":2015006},{"$f":"VLOOKUP(Q15,MapPointConfig!$B$833:$H$1732,7,FALSE)","v":2015007},{"$f":"VLOOKUP(R15,MapPointConfig!$B$833:$H$1732,7,FALSE)","v":2015008}]
["2016001#100","2016002#100","2016003#100","2016004#100","2016005#100","2016006#100","2016007#100","2016008#100",null,null,2016001,2016002,2016003,2016004,2016005,2016006,2016007,2016008,null,{"$f":"VLOOKUP(K16,MapPointConfig!$B$833:$H$1732,7,FALSE)","v":2016001},{"$f":"VLOOKUP(L16,MapPointConfig!$B$833:$H$1732,7,FALSE)","v":2016002},{"$f":"VLOOKUP(M16,MapPointConfig!$B$833:$H$1732,7,FALSE)","v":2016003},{"$f":"VLOOKUP(N16,MapPointConfig!$B$833:$H$1732,7,FALSE)","v":2016004},{"$f":"VLOOKUP(O16,MapPointConfig!$B$833:$H$1732,7,FALSE)","v":2016005},{"$f":"VLOOKUP(P16,MapPointConfig!$B$833:$H$1732,7,FALSE)","v":2016006},{"$f":"VLOOKUP(Q16,MapPointConfig!$B$833:$H$1732,7,FALSE)","v":2016007},{"$f":"VLOOKUP(R16,MapPointConfig!$B$833:$H$1732,7,FALSE)","v":2016008}]
["2017001#100","2017002#100","2017003#100","2017004#100","2017005#100","2017006#100","2017007#100","2017008#100",null,null,2017001,2017002,2017003,2017004,2017005,2017006,2017007,2017008,null,{"$f":"VLOOKUP(K17,MapPointConfig!$B$833:$H$1732,7,FALSE)","v":2017001},{"$f":"VLOOKUP(L17,MapPointConfig!$B$833:$H$1732,7,FALSE)","v":2017002},{"$f":"VLOOKUP(M17,MapPointConfig!$B$833:$H$1732,7,FALSE)","v":2017003},{"$f":"VLOOKUP(N17,MapPointConfig!$B$833:$H$1732,7,FALSE)","v":2017004},{"$f":"VLOOKUP(O17,MapPointConfig!$B$833:$H$1732,7,FALSE)","v":2017005},{"$f":"VLOOKUP(P17,MapPointConfig!$B$833:$H$1732,7,FALSE)","v":2017006},{"$f":"VLOOKUP(Q17,MapPointConfig!$B$833:$H$1732,7,FALSE)","v":2017007},{"$f":"VLOOKUP(R17,MapPointConfig!$B$833:$H$1732,7,FALSE)","v":2017008}]
["2018001#100","2018002#100","2018003#100","2018004#100","2018005#100","2018006#100","2018007#100","2018008#100",null,null,2018001,2018002,2018003,2018004,2018005,2018006,2018007,2018008,null,{"$f":"VLOOKUP(K18,MapPointConfig!$B$833:$H$1732,7,FALSE)","v":2018001},{"$f":"VLOOKUP(L18,MapPointConfig!$B$833:$H$1732,7,FALSE)","v":2018002},{"$f":"VLOOKUP(M18,MapPointConfig!$B$833:$H$1732,7,FALSE)","v":2018003},{"$f":"VLOOKUP(N18,MapPointConfig!$B$833:$H$1732,7,FALSE)","v":2018004},{"$f":"VLOOKUP(O18,MapPointConfig!$B$833:$H$1732,7,FALSE)","v":2018005},{"$f":"VLOOKUP(P18,MapPointConfig!$B$833:$H$1732,7,FALSE)","v":2018006},{"$f":"VLOOKUP(Q18,MapPointConfig!$B$833:$H$1732,7,FALSE)","v":2018007},{"$f":"VLOOKUP(R18,MapPointConfig!$B$833:$H$1732,7,FALSE)","v":2018008}]
["2019001#100","2019002#100","2019003#100","2019004#100","2019005#100","2019006#100","2019007#100","2019008#100",null,null,2019001,2019002,2019003,2019004,2019005,2019006,2019007,2019008,null,{"$f":"VLOOKUP(K19,MapPointConfig!$B$833:$H$1732,7,FALSE)","v":2019001},{"$f":"VLOOKUP(L19,MapPointConfig!$B$833:$H$1732,7,FALSE)","v":2019002},{"$f":"VLOOKUP(M19,MapPointConfig!$B$833:$H$1732,7,FALSE)","v":2019003},{"$f":"VLOOKUP(N19,MapPointConfig!$B$833:$H$1732,7,FALSE)","v":2019004},{"$f":"VLOOKUP(O19,MapPointConfig!$B$833:$H$1732,7,FALSE)","v":2019005},{"$f":"VLOOKUP(P19,MapPointConfig!$B$833:$H$1732,7,FALSE)","v":2019006},{"$f":"VLOOKUP(Q19,MapPointConfig!$B$833:$H$1732,7,FALSE)","v":2019007},{"$f":"VLOOKUP(R19,MapPointConfig!$B$833:$H$1732,7,FALSE)","v":2019008}]
["2020001#100","2020002#100","2020003#100","2020004#100","2020005#100","2020006#100","2020007#100","2020008#100",null,null,2020001,2020002,2020003,2020004,2020005,2020006,2020007,2020008,null,{"$f":"VLOOKUP(K20,MapPointConfig!$B$833:$H$1732,7,FALSE)","v":2020001},{"$f":"VLOOKUP(L20,MapPointConfig!$B$833:$H$1732,7,FALSE)","v":2020002},{"$f":"VLOOKUP(M20,MapPointConfig!$B$833:$H$1732,7,FALSE)","v":2020003},{"$f":"VLOOKUP(N20,MapPointConfig!$B$833:$H$1732,7,FALSE)","v":2020004},{"$f":"VLOOKUP(O20,MapPointConfig!$B$833:$H$1732,7,FALSE)","v":2020005},{"$f":"VLOOKUP(P20,MapPointConfig!$B$833:$H$1732,7,FALSE)","v":2020006},{"$f":"VLOOKUP(Q20,MapPointConfig!$B$833:$H$1732,7,FALSE)","v":2020007},{"$f":"VLOOKUP(R20,MapPointConfig!$B$833:$H$1732,7,FALSE)","v":2020008}]
["2021001#100","2021002#100","2021003#100","2021004#100","2021005#100","2021006#100","2021007#100","2021008#100",null,null,2021001,2021002,2021003,2021004,2021005,2021006,2021007,2021008,null,{"$f":"VLOOKUP(K21,MapPointConfig!$B$833:$H$1732,7,FALSE)","v":2021001},{"$f":"VLOOKUP(L21,MapPointConfig!$B$833:$H$1732,7,FALSE)","v":2021002},{"$f":"VLOOKUP(M21,MapPointConfig!$B$833:$H$1732,7,FALSE)","v":2021003},{"$f":"VLOOKUP(N21,MapPointConfig!$B$833:$H$1732,7,FALSE)","v":2021004},{"$f":"VLOOKUP(O21,MapPointConfig!$B$833:$H$1732,7,FALSE)","v":2021005},{"$f":"VLOOKUP(P21,MapPointConfig!$B$833:$H$1732,7,FALSE)","v":2021006},{"$f":"VLOOKUP(Q21,MapPointConfig!$B$833:$H$1732,7,FALSE)","v":2021007},{"$f":"VLOOKUP(R21,MapPointConfig!$B$833:$H$1732,7,FALSE)","v":2021008}]
["2022001#100","2022002#100","2022003#100","2022004#100","2022005#100","2022006#100","2022007#100","2022008#100",null,null,2022001,2022002,2022003,2022004,2022005,2022006,2022007,2022008,null,{"$f":"VLOOKUP(K22,MapPointConfig!$B$833:$H$1732,7,FALSE)","v":2022001},{"$f":"VLOOKUP(L22,MapPointConfig!$B$833:$H$1732,7,FALSE)","v":2022002},{"$f":"VLOOKUP(M22,MapPointConfig!$B$833:$H$1732,7,FALSE)","v":2022003},{"$f":"VLOOKUP(N22,MapPointConfig!$B$833:$H$1732,7,FALSE)","v":2022004},{"$f":"VLOOKUP(O22,MapPointConfig!$B$833:$H$1732,7,FALSE)","v":2022005},{"$f":"VLOOKUP(P22,MapPointConfig!$B$833:$H$1732,7,FALSE)","v":2022006},{"$f":"VLOOKUP(Q22,MapPointConfig!$B$833:$H$1732,7,FALSE)","v":2022007},{"$f":"VLOOKUP(R22,MapPointConfig!$B$833:$H$1732,7,FALSE)","v":2022008}]
["2023001#100","2023002#100","2023003#100","2023004#100","2023005#100","2023006#100","2023007#100","2023008#100",null,null,2023001,2023002,2023003,2023004,2023005,2023006,2023007,2023008,null,{"$f":"VLOOKUP(K23,MapPointConfig!$B$833:$H$1732,7,FALSE)","v":2023001},{"$f":"VLOOKUP(L23,MapPointConfig!$B$833:$H$1732,7,FALSE)","v":2023002},{"$f":"VLOOKUP(M23,MapPointConfig!$B$833:$H$1732,7,FALSE)","v":2023003},{"$f":"VLOOKUP(N23,MapPointConfig!$B$833:$H$1732,7,FALSE)","v":2023004},{"$f":"VLOOKUP(O23,MapPointConfig!$B$833:$H$1732,7,FALSE)","v":2023005},{"$f":"VLOOKUP(P23,MapPointConfig!$B$833:$H$1732,7,FALSE)","v":2023006},{"$f":"VLOOKUP(Q23,MapPointConfig!$B$833:$H$1732,7,FALSE)","v":2023007},{"$f":"VLOOKUP(R23,MapPointConfig!$B$833:$H$1732,7,FALSE)","v":2023008}]
["2024001#100","2024002#100","2024003#100","2024004#100","2024005#100","2024006#100","2024007#100","2024008#100",null,null,2024001,2024002,2024003,2024004,2024005,2024006,2024007,2024008,null,{"$f":"VLOOKUP(K24,MapPointConfig!$B$833:$H$1732,7,FALSE)","v":2024001},{"$f":"VLOOKUP(L24,MapPointConfig!$B$833:$H$1732,7,FALSE)","v":2024002},{"$f":"VLOOKUP(M24,MapPointConfig!$B$833:$H$1732,7,FALSE)","v":2024003},{"$f":"VLOOKUP(N24,MapPointConfig!$B$833:$H$1732,7,FALSE)","v":2024004},{"$f":"VLOOKUP(O24,MapPointConfig!$B$833:$H$1732,7,FALSE)","v":2024005},{"$f":"VLOOKUP(P24,MapPointConfig!$B$833:$H$1732,7,FALSE)","v":2024006},{"$f":"VLOOKUP(Q24,MapPointConfig!$B$833:$H$1732,7,FALSE)","v":2024007},{"$f":"VLOOKUP(R24,MapPointConfig!$B$833:$H$1732,7,FALSE)","v":2024008}]
["2025001#100","2025002#100","2025003#100","2025004#100","2025005#100","2025006#100","2025007#100","2025008#100",null,null,2025001,2025002,2025003,2025004,2025005,2025006,2025007,2025008,null,{"$f":"VLOOKUP(K25,MapPointConfig!$B$833:$H$1732,7,FALSE)","v":2025001},{"$f":"VLOOKUP(L25,MapPointConfig!$B$833:$H$1732,7,FALSE)","v":2025002},{"$f":"VLOOKUP(M25,MapPointConfig!$B$833:$H$1732,7,FALSE)","v":2025003},{"$f":"VLOOKUP(N25,MapPointConfig!$B$833:$H$1732,7,FALSE)","v":2025004},{"$f":"VLOOKUP(O25,MapPointConfig!$B$833:$H$1732,7,FALSE)","v":2025005},{"$f":"VLOOKUP(P25,MapPointConfig!$B$833:$H$1732,7,FALSE)","v":2025006},{"$f":"VLOOKUP(Q25,MapPointConfig!$B$833:$H$1732,7,FALSE)","v":2025007},{"$f":"VLOOKUP(R25,MapPointConfig!$B$833:$H$1732,7,FALSE)","v":2025008}]
["2026001#100","2026002#100","2026003#100","2026004#100","2026005#100","2026006#100","2026007#100","2026008#100",null,null,2026001,2026002,2026003,2026004,2026005,2026006,2026007,2026008,null,{"$f":"VLOOKUP(K26,MapPointConfig!$B$833:$H$1732,7,FALSE)","v":2026001},{"$f":"VLOOKUP(L26,MapPointConfig!$B$833:$H$1732,7,FALSE)","v":2026002},{"$f":"VLOOKUP(M26,MapPointConfig!$B$833:$H$1732,7,FALSE)","v":2026003},{"$f":"VLOOKUP(N26,MapPointConfig!$B$833:$H$1732,7,FALSE)","v":2026004},{"$f":"VLOOKUP(O26,MapPointConfig!$B$833:$H$1732,7,FALSE)","v":2026005},{"$f":"VLOOKUP(P26,MapPointConfig!$B$833:$H$1732,7,FALSE)","v":2026006},{"$f":"VLOOKUP(Q26,MapPointConfig!$B$833:$H$1732,7,FALSE)","v":2026007},{"$f":"VLOOKUP(R26,MapPointConfig!$B$833:$H$1732,7,FALSE)","v":2026008}]
["2027001#100","2027002#100","2027003#100","2027004#100","2027005#100","2027006#100","2027007#100","2027008#100",null,null,2027001,2027002,2027003,2027004,2027005,2027006,2027007,2027008,null,{"$f":"VLOOKUP(K27,MapPointConfig!$B$833:$H$1732,7,FALSE)","v":2027001},{"$f":"VLOOKUP(L27,MapPointConfig!$B$833:$H$1732,7,FALSE)","v":2027002},{"$f":"VLOOKUP(M27,MapPointConfig!$B$833:$H$1732,7,FALSE)","v":2027003},{"$f":"VLOOKUP(N27,MapPointConfig!$B$833:$H$1732,7,FALSE)","v":2027004},{"$f":"VLOOKUP(O27,MapPointConfig!$B$833:$H$1732,7,FALSE)","v":2027005},{"$f":"VLOOKUP(P27,MapPointConfig!$B$833:$H$1732,7,FALSE)","v":2027006},{"$f":"VLOOKUP(Q27,MapPointConfig!$B$833:$H$1732,7,FALSE)","v":2027007},{"$f":"VLOOKUP(R27,MapPointConfig!$B$833:$H$1732,7,FALSE)","v":2027008}]
["2028001#100","2028002#100","2028003#100","2028004#100","2028005#100","2028006#100","2028007#100","2028008#100",null,null,2028001,2028002,2028003,2028004,2028005,2028006,2028007,2028008,null,{"$f":"VLOOKUP(K28,MapPointConfig!$B$833:$H$1732,7,FALSE)","v":2028001},{"$f":"VLOOKUP(L28,MapPointConfig!$B$833:$H$1732,7,FALSE)","v":2028002},{"$f":"VLOOKUP(M28,MapPointConfig!$B$833:$H$1732,7,FALSE)","v":2028003},{"$f":"VLOOKUP(N28,MapPointConfig!$B$833:$H$1732,7,FALSE)","v":2028004},{"$f":"VLOOKUP(O28,MapPointConfig!$B$833:$H$1732,7,FALSE)","v":2028005},{"$f":"VLOOKUP(P28,MapPointConfig!$B$833:$H$1732,7,FALSE)","v":2028006},{"$f":"VLOOKUP(Q28,MapPointConfig!$B$833:$H$1732,7,FALSE)","v":2028007},{"$f":"VLOOKUP(R28,MapPointConfig!$B$833:$H$1732,7,FALSE)","v":2028008}]
["2029001#100","2029002#100","2029003#100","2029004#100","2029005#100","2029006#100","2029007#100","2029008#100",null,null,2029001,2029002,2029003,2029004,2029005,2029006,2029007,2029008,null,{"$f":"VLOOKUP(K29,MapPointConfig!$B$833:$H$1732,7,FALSE)","v":2029001},{"$f":"VLOOKUP(L29,MapPointConfig!$B$833:$H$1732,7,FALSE)","v":2029002},{"$f":"VLOOKUP(M29,MapPointConfig!$B$833:$H$1732,7,FALSE)","v":2029003},{"$f":"VLOOKUP(N29,MapPointConfig!$B$833:$H$1732,7,FALSE)","v":2029004},{"$f":"VLOOKUP(O29,MapPointConfig!$B$833:$H$1732,7,FALSE)","v":2029005},{"$f":"VLOOKUP(P29,MapPointConfig!$B$833:$H$1732,7,FALSE)","v":2029006},{"$f":"VLOOKUP(Q29,MapPointConfig!$B$833:$H$1732,7,FALSE)","v":2029007},{"$f":"VLOOKUP(R29,MapPointConfig!$B$833:$H$1732,7,FALSE)","v":2029008}]
["2030001#100","2030002#100","2030003#100","2030004#100","2030005#100","2030006#100","2030007#100","2030008#100",null,null,2030001,2030002,2030003,2030004,2030005,2030006,2030007,2030008,null,{"$f":"VLOOKUP(K30,MapPointConfig!$B$833:$H$1732,7,FALSE)","v":2030001},{"$f":"VLOOKUP(L30,MapPointConfig!$B$833:$H$1732,7,FALSE)","v":2030002},{"$f":"VLOOKUP(M30,MapPointConfig!$B$833:$H$1732,7,FALSE)","v":2030003},{"$f":"VLOOKUP(N30,MapPointConfig!$B$833:$H$1732,7,FALSE)","v":2030004},{"$f":"VLOOKUP(O30,MapPointConfig!$B$833:$H$1732,7,FALSE)","v":2030005},{"$f":"VLOOKUP(P30,MapPointConfig!$B$833:$H$1732,7,FALSE)","v":2030006},{"$f":"VLOOKUP(Q30,MapPointConfig!$B$833:$H$1732,7,FALSE)","v":2030007},{"$f":"VLOOKUP(R30,MapPointConfig!$B$833:$H$1732,7,FALSE)","v":2030008}]
{"$rows_left_out":171}
{"sheet":"Sheet2","index":2,"n_rows":25,"n_cols":2,"rows_kept":25}
[]
[1,"怪"]
[2,"精英怪"]
[3,"回血buff"]
[4,"试炼福利怪"]
[5,"暂未使用"]
[6,"开视野点"]
[7,"npc"]
[8,"金宝箱"]
[9,"传送门"]
[10,"史诗怪"]
[11,"任务道具"]
[12,"云游商人"]
[13,"暂未使用"]
[14,"攻击buff"]
[15,"防御buff"]
[16,"特殊buff"]
[17,"通缉怪"]
[18,"转盘游戏"]
[19,"挖矿游戏"]
[20,"彼岸花"]
[21,"buff采集"]
[22,"丹药葫芦"]
[23,"传送门1"]
[24,"传送门2"]

{"sheet":"事件点刷新规则","index":3,"n_rows":6,"n_cols":7,"rows_kept":6}
["编号","名称","描述"]
[1,"每日刷新","被销毁的事件点，到达第二天系统刷新时间后，再次进图时会重新生成该时间点。没有被销毁的事件点按探索刷新规则刷新。"]
[2,"探索刷新","不论事件点是否被销毁，再次进图时会重新生成该id的事件点"]
[3,"一次性","事件点不会重新生成。没有被销毁的事件点会保存当前进度。"]
[]
[{"$f":"A1+1000","v":{"$error":"#VALUE!"}},{"$f":"B1","v":"名称"},{"$f":"\"试炼\"&IF(INT(MID(A6,2,3))<10,MID(A6,4,1),IF(INT(MID(A6,2,3))<100,MID(A6,3,2),MID(A6,2,3)))&\"层\"&IF(INT(RIGHT(A6,1))=0,\"boss\",\"普通怪\"&RIGHT(A6,1))","v":{"$error":"#VALUE!"}},{"$f":"D1","v":0},2,1,{"$f":"A6","v":{"$error":"#VALUE!"}}]