{"text_format":"3","workbook":"xlsx","n_sheets":8,"sheets":["EquipConfig","辅助表","装备等级分类","装备等级分类辅助","1","合成装备","装备分类辅助表","装备属性重制版辅助表"],"not_rendered":{"images":1,"external_links":2,"defined_names":3},"read":"whole","date_system":"1900"}

{"sheet":"EquipConfig","index":0,"n_rows":134,"n_cols":30,"rows_kept":134}
[null,"Id","Name","SuiteID","Quality","ProfessionLimit","Position","Star","Property","PropertyMin","PropertyMax","PassiveSkill","Pool","SecondNumMin","SecondNumMax","limit","Formula","Resource","Bcakground","Range","Describe","Parameter","SkillPoolId","InitialLevel","IfClear","IfShow","Score","NoUse1","NoUse3","NoUse4"]
[null,"int","string","int","int","int","int","int","mut,int#int,2","mut,int#int,1","mut,int#int,1","mut,int#int,1","mut,int#int,1","int","int","int","mut,int#int,2","mut,int#int,2","string","mut,int#int,1","string","mut,string#string,2","mut,int#int,1","int","int","int","int","string","string","string"]
[null,2,3,2,2,2,2,2,2,2,2,2,2,2,2,2,2,2,3,2,3,3,2,2,2,3,2,0,0,0]
[null,"道具id","道具名","所属套装id","装备品质\n2绿色\n3蓝色\n4紫色\n5橙色\n6红色                              7彩色","职业限定\n0 不限定\n1、武卫；2、天罚；3、秘法；4，玄策；5，生花","位置\n(1武器 2全身铠甲 3头饰 4鞋子 5魂印）","装备星级","属性\n属性id#num\n（属性id找propertyconfig表）","属性区间min\n属性id#num\n（属性id找propertyconfig表）","属性区间max\n属性id#num","被动效果id（去PassiveSkillLogicConfig表找）","附属性库","副属性随机最少个数，不重复","副属性最多随机个数，不重复","是否唯一（是否只能一名武将佩戴）\n1是\n0否","合成公式 \n（品质id（Quality）#数量）","合成消耗\n材料id#数量（itemconfig找道具id）","背景描述","适用英雄\n英雄id#英雄id\n0代表所有英雄均适用","适用英雄描述%s代表","英雄效果参数#英雄效果参数|英雄效果参数#英雄次效果参数\n为0时只显示describe列","附带技能库id","初始自带重置等级","是否可重铸\n0不可重铸\n1可重铸","是否在图鉴中显示\n0不显示\n1显示","战力评分","没啥用、","没啥用、","没啥用、"]
["默认值",0,{"$f":"\"\"","v":""},0,null,0,0,0,null,"null","null",null,"null",0,0,{"$nulls":8},0,0,null,0,{"$f":"\"\"","v":""},{"$f":"\"\"","v":""},{"$f":"\"\"","v":""}]
["正确性校对",{"$nulls":24},0]
["校对值"]
[null,60001,"猎户大斧",null,2,0,1,1,"2#120","2#120","2#120",{"$nulls":12},0,0]
[null,60002,"兽骨大斧",null,2,0,1,2,"2#150","2#150","2#150",{"$nulls":12},0,0]
[null,60016,"戍卫战甲",null,2,0,2,1,"3#40","3#40","3#40",{"$nulls":12},0,0]
[null,60017,"硬木战甲",null,2,0,2,2,"3#50","3#50","3#50",{"$nulls":12},0,0]
[null,60022,"猎户草帽",null,2,0,3,1,"4#40","4#40","4#40",{"$nulls":12},0,0]
[null,60023,"兽皮兜帽",null,2,0,3,2,"4#50","4#50","4#50",{"$nulls":12},0,0]
[null,60025,"猎户草鞋",null,2,0,4,1,"1#800","1#800","1#800",{"$nulls":12},0,0]
[null,60026,"兽皮皮靴",null,2,0,4,2,"1#1000","1#1000","1#1000",{"$nulls":12},0,0]
{"$rows_left_out":120}
{"sheet":"辅助表","index":1,"n_rows":118,"n_cols":35,"rows_kept":118}
[null,"装备id","装备名字","位置","武器名字","主属性","主属性id","品质","辅助列","主属性数值min","主属性数值max","输出","输出"]
[null,3001,"绿色武卫武器1",1,{"$f":"LEFT(RIGHT(C2,3),2)","v":"武器"},{"$f":"VLOOKUP(E2,$Y$7:$Z$11,2,0)","v":"攻击"},{"$f":"VLOOKUP(F2,$Y$16:$Z$39,2,0)","v":2},{"$f":"LEFT(C2,2)","v":"绿色"},{"$f":"H2&F2","v":"绿色攻击"},{"$f":"ROUND(VLOOKUP(I2,$AD$21:$AF$40,2,0)*VLOOKUP(E2,$Y$7:$AA$11,3,0),0)","v":42},{"$f":"ROUND(VLOOKUP(I2,$AD$21:$AF$40,3,0)*VLOOKUP(E2,$Y$7:$AA$11,3,0),0)","v":70},{"$f":"$G2&\"#\"&J2","v":"2#42"},{"$f":"$G2&\"#\"&K2","v":"2#70"},{"$f":"IF(OR(E2=\"布甲\",E2=\"板甲\"),H2&\"铠甲\",H2&E2)","v":"绿色武器"},{"$f":"VLOOKUP(N2,[1]Sheet1!A:B,2,0)","v":{"$error":"#N/A"}},{"$nulls":14},"装备上限","装备下限","速度上限","速度下线","百分比属性","工坊放大两倍"]
[null,3002,"绿色武卫武器2",1,{"$f":"LEFT(RIGHT(C3,3),2)","v":"武器"},{"$f":"VLOOKUP(E3,$Y$7:$Z$11,2,0)","v":"攻击"},{"$f":"VLOOKUP(F3,$Y$16:$Z$39,2,0)","v":2},{"$f":"LEFT(C3,2)","v":"绿色"},{"$f":"H3&F3","v":"绿色攻击"},{"$f":"ROUND(VLOOKUP(I3,$AD$21:$AF$40,2,0)*VLOOKUP(E3,$Y$7:$AA$11,3,0),0)","v":42},{"$f":"ROUND(VLOOKUP(I3,$AD$21:$AF$40,3,0)*VLOOKUP(E3,$Y$7:$AA$11,3,0),0)","v":70},{"$f":"$G3&\"#\"&J3","v":"2#42"},{"$f":"$G3&\"#\"&K3","v":"2#70"},{"$f":"IF(OR(E3=\"布甲\",E3=\"板甲\"),H3&\"铠甲\",H3&E3)","v":"绿色武器"},{"$f":"VLOOKUP(N3,[1]Sheet1!A:B,2,0)","v":{"$error":"#N/A"}},{"$nulls":13},"绿",0.581060606060605,{"$f":"AD3*0.6","v":0.34863636363636297},0.25,{"$f":"AF3*0.85","v":0.2125}]
[null,3003,"绿色生花武器1",1,"武器","攻击",2,"绿色","绿色攻击",42,70,"2#42","2#70","绿色武器",{"$f":"VLOOKUP(N4,[1]Sheet1!A:B,2,0)","v":{"$error":"#N/A"}},{"$nulls":13},"蓝",0.778030303030301,{"$f":"AD4*0.6","v":0.4668181818181806},0.5,{"$f":"AF4*0.85","v":0.425},20]
[null,3004,"绿色生花武器2",1,"武器","攻击",2,"绿色","绿色攻击",42,70,"2#42","2#70","绿色武器",{"$f":"VLOOKUP(N5,[1]Sheet1!A:B,2,0)","v":{"$error":"#N/A"}},{"$nulls":13},"紫",1,0.6,0.75,0.6375,40]
[null,3005,"绿色秘法武器1",1,"武器","攻击",2,"绿色","绿色攻击",42,70,"2#42","2#70","绿色武器",{"$f":"VLOOKUP(N6,[1]Sheet1!A:B,2,0)","v":{"$error":"#N/A"}},{"$nulls":13},"橙",5.31818181818182,3.190909090909092,1,0.85,60]
[null,3006,"绿色秘法武器2",1,"武器","攻击",2,"绿色","绿色攻击",42,70,"2#42","2#70","绿色武器",{"$f":"VLOOKUP(N7,[1]Sheet1!A:B,2,0)","v":{"$error":"#N/A"}},{"$nulls":9},"武器","攻击",0.6]
[null,3007,"绿色天罚武器1",1,"武器","攻击",2,"绿色","绿色攻击",42,70,"2#42","2#70","绿色武器",{"$f":"VLOOKUP(N8,[1]Sheet1!A:B,2,0)","v":{"$error":"#N/A"}},{"$nulls":9},"布甲","魔抗",0.58]
[null,3008,"绿色天罚武器2",1,"武器","攻击",2,"绿色","绿色攻击",42,70,"2#42","2#70","绿色武器",{"$f":"VLOOKUP(N9,[1]Sheet1!A:B,2,0)","v":{"$error":"#N/A"}},{"$nulls":9},"板甲","护甲",0.62]
[null,3009,"绿色玄策武器1",1,"武器","攻击",2,"绿色","绿色攻击",42,70,"2#42","2#70","绿色武器",{"$f":"VLOOKUP(N10,[1]Sheet1!A:B,2,0)","v":{"$error":"#N/A"}},{"$nulls":9},"鞋子","速度",0.64,null,"基础属性"]
[null,3010,"绿色玄策武器2",1,"武器","攻击",2,"绿色","绿色攻击",42,70,"2#42","2#70","绿色武器",{"$f":"VLOOKUP(N11,[1]Sheet1!A:B,2,0)","v":{"$error":"#N/A"}},{"$nulls":9},"头饰","生命",0.55,null,null,"生命",2400]
[null,3011,"绿色板甲1",2,"板甲","护甲",3,"绿色","绿色护甲",43,72,"3#43","3#72","绿色铠甲",{"$f":"VLOOKUP(N12,[1]Sheet1!A:B,2,0)","v":{"$error":"#N/A"}},{"$nulls":14},"攻击",200]
[null,3012,"绿色板甲2",2,"板甲","护甲",3,"绿色","绿色护甲",43,72,"3#43","3#72","绿色铠甲",{"$f":"VLOOKUP(N13,[1]Sheet1!A:B,2,0)","v":{"$error":"#N/A"}},{"$nulls":14},"护甲",200]
[null,3013,"绿色布甲1",2,"布甲","魔抗",4,"绿色","绿色魔抗",40,67,"4#40","4#67","绿色铠甲",{"$f":"VLOOKUP(N14,[1]Sheet1!A:B,2,0)","v":{"$error":"#N/A"}},{"$nulls":14},"魔抗",200]
[null,3014,"绿色布甲2",2,"布甲","魔抗",4,"绿色","绿色魔抗",40,67,"4#40","4#67","绿色铠甲",{"$f":"VLOOKUP(N15,[1]Sheet1!A:B,2,0)","v":{"$error":"#N/A"}},{"$nulls":14},"速度",176]
{"$rows_left_out":104}
{"sheet":"装备等级分类","index":2,"n_rows":54,"n_cols":17,"rows_kept":54,"merged":[[2,11,20,11],[2,12,7,12],[2,13,3,13],[4,13,7,13],[4,14,6,14],[4,16,6,16],[8,12,13,12],[8,13,13,13],[10,14,12,14],[10,16,12,16],[14,12,20,12],[14,13,20,13],[14,14,16,14],[14,16,16,16],[17,14,20,14],[18,16,20,16],[21,11,53,11],[21,12,31,12],[21,13,31,13],[23,14,24,14],[23,16,24,16],[25,14,27,14],[26,16,27,16],[28,14,31,14],[29,16,31,16],[32,12,39,12],[32,13,39,13],[33,14,35,14],[34,16,35,16],[36,14,39,14],[37,16,39,16],[40,12,53,12],[40,13,53,13],[40,14,42,14],[41,16,42,16],[43,14,45,14],[44,16,45,16],[46,14,48,14],[47,16,48,16],[49,14,52,14],[50,16,52,16]]}
[]
[null,"部位",null,null,"紫色","橙色",null,null,"副属性","特性",null,"装备阶梯","副属性数量","副属性库","特性","重铸等级"]
[1,"武器",null,1,"2-2","3-3",null,"1","生命、攻击、护甲、魔抗","固定伤害类/固定回复类",null,"紫色","2-2","1","0","0",1]
[2,"鞋",null,2,"2-2re","3-3re",null,"2","速度、抗暴、效果命中、效果抵抗","视作属性类",{"$nulls":4},"1","0","2"]
[3,"甲、头、腰",null,3,"2-2t","3-3t",null,"3","暴击、暴伤、治疗、受治疗","buff类/debuff类",{"$nulls":3},"1、2","0","30","3"]
[4,"戒",null,4,"2-3","3-4",null,"4","属性伤害、属性抵抗、伤害加成、伤害减免","属性伤害类/属性回复类",{"$nulls":5},"40"]
[5,null,null,5,"3-3re","3-4re",null,"5",null,"控制类/增加属性类",{"$nulls":5},"50"]
[6,null,null,6,"3-3t","3-4t",null,"6",null,"吸血/免疫",{"$nulls":4},"1、2","0","4"]
[7,{"$nulls":6},"7",null,"伤害加成/减伤类",null,null,"2-3","1、2","0","0","5"]
[{"$nulls":14},"1、2","0","6"]
[{"$nulls":14},"0","30","7"]
[{"$nulls":15},"40"]
[{"$nulls":8},"副属性中不会出现主属性","回复类只出现在生花、玄策武器中",{"$nulls":5},"50"]
[{"$nulls":8},"防御类只在2、3部位中出现","控制类只出现在玄策、武卫武器中",{"$nulls":4},"1、2、3","0","8"]
[{"$nulls":8},"攻击类只在1、4部位中出现","使用特性47时，遵循副属性的梯度规则",null,null,"3-3","1、2、3","0","30","9"]
{"$rows_left_out":40}
{"sheet":"装备等级分类辅助","index":3,"n_rows":37,"n_cols":26,"rows_kept":37,"merged":[[1,13,2,13],[1,23,11,23],[3,13,6,13],[7,13,12,13],[12,23,19,23],[13,13,22,13],[20,23,36,23]]}
[null,"最终表","最终表",null,"最终表","最终表",{"$nulls":5},"属性分配","属性分配",{"$nulls":8},"属性分配","属性分配"]
[null,{"$f":"VLOOKUP($I$4,$H$7:$I$11,2,FALSE)&\"#\"&INT(L2)","v":"5#293"},{"$f":"VLOOKUP($I$4,$H$7:$I$11,2,FALSE)&\"#\"&INT(M2)","v":"5#325"},null,{"$f":"VLOOKUP($S$4,$H$7:$I$11,2,FALSE)&\"#\"&INT(V2)","v":"5#560"},{"$f":"VLOOKUP($S$4,$H$7:$I$11,2,FALSE)&\"#\"&INT(W2)","v":"5#622"},null,"属性下限",293,null,0.9,{"$f":"$I$2","v":293},{"$f":"$L$2/K2","v":325.55555555555554},"1",null,1,null,"属性下限",560,null,0.9,{"$f":"$S$2","v":560},{"$f":"V2/U2","v":622.2222222222222},"1、2",null,5]
[null,{"$f":"VLOOKUP($I$4,$H$7:$I$11,2,FALSE)&\"#\"&INT(L3)","v":"5#294"},{"$f":"VLOOKUP($I$4,$H$7:$I$11,2,FALSE)&\"#\"&INT(M3)","v":"5#333"},null,{"$f":"VLOOKUP($S$4,$H$7:$I$11,2,FALSE)&\"#\"&INT(V3)","v":"5#558"},{"$f":"VLOOKUP($S$4,$H$7:$I$11,2,FALSE)&\"#\"&INT(W3)","v":"5#627"},null,"属性上限",480,null,0.885,{"$f":"M3*K3","v":294.9508333333333},{"$f":"M2+(M23-M2)/20","v":333.27777777777777},{"$nulls":4},"属性上限",840,null,0.89,{"$f":"W3*U3","v":558.6233333333333},{"$f":"$W$2+(($W$37-$W$2)*5/20)*Y3/10","v":627.6666666666666},null,1]
[null,"5#298","5#339",null,"5#563","5#633",null,"属性","速度",null,0.88,{"$f":"M4*K4","v":298.3811111111111},{"$f":"$M$3+(($M$23-$M$3)*3/19)*O4/4","v":339.06944444444446},"1、2",1,3,null,"属性","速度",null,0.89,563.4688888888888,{"$f":"$W$2+(($W$37-$W$2)*5/20)*Y4/10","v":633.1111111111111},null,2]
[null,"5#301","5#344",null,"5#568","5#638",{"$nulls":4},0.875,301.7534722222222,{"$f":"$M$3+(($M$23-$M$3)*3/19)*O5/4","v":344.8611111111111},null,2,{"$nulls":5},0.89,568.3144444444445,638.5555555555555,null,3]
[null,"5#305","5#350",null,"5#566","5#644",{"$nulls":4},0.87,305.06791666666663,350.65277777777777,null,3,{"$nulls":5},0.88,566.72,644,null,4]
[null,"5#308","5#356",null,"5#571","5#649",null,"生命",1,null,0.865,308.32444444444445,356.44444444444446,null,4,{"$nulls":5},0.88,571.5111111111111,649.4444444444443,null,5]
[null,"5#313","5#364",null,"5#576","5#654",null,"攻击",2,null,0.86,313.18333333333334,{"$f":"$M$7+(($M$23-$M$7)*6/16)*O8/6","v":364.1666666666667},"1、2",1,6,{"$nulls":4},0.88,576.3022222222221,654.8888888888888,null,6]
[null,"5#318","5#371",null,"5#581","5#660",null,"护甲",3,null,0.856,318.3368888888889,{"$f":"$M$7+(($M$23-$M$7)*6/16)*O9/6","v":371.8888888888889},null,2,{"$nulls":5},0.88,581.0933333333332,660.3333333333333,null,7]
[null,"5#323","5#379",null,"5#579","5#665",null,"魔抗",4,null,0.853,323.8082777777778,379.61111111111114,null,3,{"$nulls":5},0.87,579.2266666666666,665.7777777777777,null,8]
[null,"5#329","5#387",null,"5#583","5#671",null,"速度",5,null,0.85,329.23333333333335,387.33333333333337,null,4,{"$nulls":5},0.87,583.9633333333333,671.2222222222222,null,9]
[null,"5#334","5#395",null,"5#588","5#676",{"$nulls":4},0.846,334.217,395.05555555555554,null,5,{"$nulls":5},0.87,588.6999999999999,676.6666666666666,null,10]
[null,"5#339","5#402",null,"5#587","5#683",{"$nulls":4},0.843,339.54166666666663,402.77777777777777,null,6,{"$nulls":5},0.86,587.786111111111,{"$f":"$W$12+(($W$37-$W$12)*5/15)*Y13/8","v":683.4722222222222},"1、2、3",1,5]
[null,"5#344","5#410",null,"5#593","5#690",{"$nulls":4},0.84,344.82,{"$f":"$M$13+(($M$23-$M$13))*O14/10","v":410.5},"1、2、3",1,10,{"$nulls":4},0.86,593.6388888888888,{"$f":"$W$12+(($W$37-$W$12)*5/15)*Y14/8","v":690.2777777777777},null,2]
[null,"5#349","5#418",null,"5#599","5#697",{"$nulls":4},0.836,349.63377777777777,{"$f":"$M$13+(($M$23-$M$13))*O15/10","v":418.22222222222223},null,2,{"$nulls":5},0.86,599.4916666666666,697.0833333333333,null,3]
{"$rows_left_out":23}
{"sheet":"1","index":4,"n_rows":55,"n_cols":9,"rows_kept":55}
[null,null,"品质","道具名","道具品质",null,"类型英文","道具类型","资源名"]
[{"$f":"LEFT(C2,2)","v":"绿色"},"服饰","绿色装备","铁制锁子甲","高级",null,"CA","服饰","r_equip_CA_0001"]
[{"$f":"LEFT(C3,2)","v":"绿色"},"武卫","绿色装备","铁制巨剑","高级",null,"GS","武器","r_equip_GS_0001"]
["绿色","头饰","绿色装备","铁制耳环","高级",null,"HA","头饰","r_equip_HA_0001"]
["绿色","玄策","绿色装备","铁制双拐","高级",null,"HS","武器","r_equip_HS_0001"]
["绿色","秘法","绿色装备","铁制秘器","高级",null,"HW","武器","r_equip_HW_0001"]
["绿色","生花","绿色装备","铁制法器","高级",null,"MW","武器","r_equip_MW_0001"]
["绿色","服饰","绿色装备","铁制板甲","高级",null,"PA","服饰","r_equip_PA_0001"]
["绿色","天罚","绿色装备","铁制星槌","高级",null,"SH","武器","r_equip_SH_0001"]
["绿色","靴","绿色装备","铁制军靴","高级",null,"Shoes","靴","r_equip_Shoes_0001"]
["蓝色","武卫","蓝色装备","黑铁巨剑","顶级",null,"GS","武器","r_equip_GS_0002"]
["蓝色","秘法","蓝色装备","黑铁秘器","顶级",null,"HW","武器","r_equip_HW_0002"]
["蓝色","生花","蓝色装备","黑铁法器","顶级",null,"MW","武器","r_equip_MW_0002"]
["蓝色","玄策","蓝色装备","黑铁双拐","顶级",null,"HS","武器","r_equip_HS_0002"]
["蓝色","天罚","蓝色装备","黑铁星槌","顶级",null,"SH","武器","r_equip_SH_0002"]
{"$rows_left_out":41}
{"sheet":"合成装备","index":5,"n_rows":113,"n_cols":13,"rows_kept":113}
[]
[53005,"玄金法杖",3,1,1,"2#479","2#564",3,1,2,0,0,0]
[53006,"墨玉法杖",3,1,1,"2#499","2#588",4,1,2,0,0,0]
[53007,"神行法杖",3,1,1,"2#520","2#612",3,1,2,0,0,0]
[53019,"玄金长剑",3,2,1,"2#479","2#564",3,1,2,0,0,0]
[53020,"墨玉长剑",3,2,1,"2#499","2#588",4,1,2,0,0,0]
[53021,"神行长剑",3,2,1,"2#520","2#612",3,1,2,0,0,0]
[53033,"玄金大斧",3,3,1,"2#479","2#564",3,1,2,0,0,0]
[53034,"墨玉大斧",3,3,1,"2#499","2#588",4,1,2,0,0,0]
[53035,"神行大戟",3,3,1,"2#520","2#612",3,1,2,0,0,0]
[53047,"玄金短剑",3,4,1,"2#479","2#564",3,1,2,0,0,0]
[53048,"墨玉短剑",3,4,1,"2#499","2#588",4,1,2,0,0,0]
[53049,"神行短剑",3,4,1,"2#520","2#612",3,1,2,0,0,0]
[53061,"玄金法杖",3,5,1,"2#479","2#564",3,1,2,0,0,0]
[53062,"墨玉法杖",3,5,1,"2#499","2#588",4,1,2,0,0,0]
{"$rows_left_out":99}
{"sheet":"装备分类辅助表","index":6,"n_rows":634,"n_cols":25,"rows_kept":634}
[null,"Id","Name","Quality","ProfessionLimit","Position","PropertyMin","PropertyMax","Pool","SecondNumMin","SecondNumMax","SkillId","InitialLevel","IfClear","Score","NoUse1","NoUse3","NoUse4"]
[null,"int","string","int","int","int","mut,int#int,1","mut,int#int,1","int","int","int","int","int","int","int","string","string","string"]
[null,2,3,2,2,2,2,2,2,2,2,2,2,2,2,0,0,0]
[null,"道具id","道具名","装备品质\n2绿色\n3蓝色\n4紫色\n5橙色","职业限定\n0 不限定\n1、秘法；2、天罚；3、武卫；4，玄策；5，生花","位置\n(1武器 2全身铠甲 3头饰 4鞋子 5戒指 6腰带）","属性区间min\n属性id#num\n（属性id找propertyconfig表）","属性区间max\n属性id#num","附属性库","副属性随机最少个数，不重复","副属性最多随机个数，不重复","附带技能id","初始自带重置等级","是否可重铸\n0不可重铸\n1可重铸","特性评分","没啥用、","没啥用、","没啥用、"]
["默认值",0,{"$f":"\"\"","v":""},null,0,0,"null","null",0,0,0,null,0,0,0,{"$f":"\"\"","v":""},"",""]
["正确性校对"]
["校对值"]
[null,52001,"猎户大锤",2,3,1,"2#204","2#240",1,0,0,null,0,0,null,{"$f":"_xlfn.IFNA(VLOOKUP(L8,[2]汇总!A:C,3,0),\"\")","v":""},null,null,2,204,null,2,240]
[null,52002,"兽骨匕首",2,3,1,"2#208","2#245",1,0,0,null,0,0,null,{"$f":"_xlfn.IFNA(VLOOKUP(L9,[2]汇总!A:C,3,0),\"\")","v":""},null,null,2,208,null,2,245]
[null,52003,"坚固宝剑",2,3,1,"2#212","2#250",1,0,0,null,0,0,null,{"$f":"_xlfn.IFNA(VLOOKUP(L10,[2]汇总!A:C,3,0),\"\")","v":""},null,null,2,212,null,2,250]
[null,52004,"家传短匕",2,3,1,"2#216","2#255",1,0,0,null,0,0,null,{"$f":"_xlfn.IFNA(VLOOKUP(L11,[2]汇总!A:C,3,0),\"\")","v":""},null,null,2,216,null,2,255]
[null,52005,"游侠战刀",2,3,1,"2#221","2#260",1,0,0,null,0,0,null,{"$f":"_xlfn.IFNA(VLOOKUP(L12,[2]汇总!A:C,3,0),\"\")","v":""},null,null,2,221,null,2,260]
[null,52006,"戍卫法杖",2,3,1,"2#225","2#265",1,0,0,null,0,0,null,{"$f":"_xlfn.IFNA(VLOOKUP(L13,[2]汇总!A:C,3,0),\"\")","v":""},null,null,2,225,null,2,265]
[null,52007,"硬木法杖",2,3,1,"2#229","2#270",1,0,0,null,0,0,null,{"$f":"_xlfn.IFNA(VLOOKUP(L14,[2]汇总!A:C,3,0),\"\")","v":""},null,null,2,229,null,2,270]
[null,52008,"黑铁法杖",2,3,1,"2#236","2#278",1,0,0,null,0,0,null,{"$f":"_xlfn.IFNA(VLOOKUP(L15,[2]汇总!A:C,3,0),\"\")","v":""},null,null,2,236,null,2,278]
{"$rows_left_out":620}
{"sheet":"装备属性重制版辅助表","index":7,"n_rows":128,"n_cols":123,"rows_kept":128}
["大区间装备",null,null,"改动后",{"$nulls":6},"主属性重新分段",{"$nulls":6},"装备数量",{"$nulls":7},"副属性重新分段",null,null,"绿2","蓝3","紫4","橙5","合计",{"$nulls":53},5,57,{"$f":"VLOOKUP(CI1,$CO$15:$CS$42,5,FALSE)","v":66}]
[null,"2#780","2#1275",null,{"$f":"B2","v":"2#780"},{"$f":"RIGHT(C2,LEN(C2)-FIND(\"#\",C2,1))","v":"1275"},{"$f":"INT(F2*0.85)","v":1083},{"$f":"LEFT(C2,2)&G2","v":"2#1083"},null,null,"紫",{"$nulls":3},"橙",null,null,4,"低级",{"v":0.25,"d":"25%"},{"v":0.3,"d":"30%"},{"$nulls":6},"效果命中",null,20,30,50,100,{"$nulls":53},53,1800,{"$f":"VLOOKUP(CI2,$CO$15:$CS$42,5,FALSE)","v":1800}]
[null,{"$f":"B2","v":"2#780"},{"$f":"C2","v":"2#1275"},null,"2#780","1275",1083,"2#1083",null,null,"2#780","2#1275",null,null,"2#1440","2#2160",null,1,"重铸50级基础",{"v":0.35,"d":"35%"},{"v":0.4,"d":"40%"},"重铸后",{"v":0.55,"d":"55%"},{"v":0.65,"d":"65%"},{"$nulls":3},"效果抵抗",null,20,30,50,100,{"$nulls":53},54,900,900]
[null,"2#780","2#1275",null,"2#780","1275",1083,"2#1083",null,null,"3#845","3#1382",null,null,"3#1560","3#2340",null,1,"中级",{"v":0.65,"d":"65%"},{"v":0.7,"d":"70%"},{"$nulls":6},"暴击率",null,null,10,20,30,{"$nulls":53},55,450,600]
[null,"2#780","2#1275",null,"2#780","1275",1083,"2#1083",null,null,"4#845","4#1382",null,null,"4#1560","4#2340",null,3,"高级",{"v":0.9,"d":"90%"},{"v":0.95,"d":"95%"},{"$nulls":6},"暴伤",null,null,30,60,90,{"$nulls":53},56,1200,1600]
[null,"2#780","2#1275",null,"2#780","1275",1083,"2#1083",null,null,"1#7800","1#12756",null,null,"1#14400","1#21600",{"$nulls":11},"属性攻击",{"$nulls":3},1600,1600,{"$nulls":53},1,765,780]
[null,"2#780","2#1275",null,"2#780","1275",1083,"2#1083",null,null,"5#293","5#480",null,null,"5#560","5#840",{"$nulls":11},"属性抗性",{"$nulls":3},1600,1600,{"$nulls":53},2,95,144]
[null,"2#780","2#1275",null,"2#780","1275",1083,"2#1083",null,null,"2#260","2#425",null,null,"2#480","2#720",null,4,"低级",{"v":0.1,"d":"10%"},{"v":0.15,"d":"15%"},{"$nulls":6},"抗暴率",{"$nulls":3},20,20,{"$nulls":53},3,166,189]
[null,"2#780","2#1275",null,"2#780","1275",1083,"2#1083",null,null,"1#2080","1#3401",null,null,"1#3840","1#5760",null,4,"中级",{"v":0.35,"d":"35%"},{"v":0.4,"d":"40%"},"重铸后",{"v":0.6,"d":"60%"},{"v":0.7,"d":"70%"},{"$nulls":22},"紫高",{"$nulls":13},"紫低",{"$nulls":12},"紫中",{"$nulls":12},4,166,189]
[{"$nulls":86},61,150,300]
[{"$nulls":86},60,75,600]
[]
[]
[null,{"$f":"B9","v":"2#780"},{"$f":"C9","v":"2#1275"},null,{"$f":"B14","v":"2#780"},{"$f":"RIGHT(C14,LEN(C14)-FIND(\"#\",C14,1))","v":"1275"},{"$f":"INT(F14*0.85)","v":1083},{"$f":"LEFT(C14,2)&G14","v":"2#1083"},{"$nulls":9},1,"重铸50级基础",{"v":0.4,"d":"40%"},{"v":0.45,"d":"45%"},{"$nulls":7},"绿2","蓝3","紫4","橙5","合计",{"$nulls":13},"属性",{"$nulls":11},"最终",null,"属性",{"$nulls":10},"最终",null,"属性",{"$nulls":10},"最终",null,"橙下",{"$nulls":9},"最终",null,"橙中",{"$nulls":9},"最终",null,null,"橙高",{"$nulls":9},"最终"]
[null,{"$f":"B14","v":"2#780"},{"$f":"C14","v":"2#1275"},null,"2#780","1275",1083,"2#1083",4,"低级",{"v":0.25,"d":"25%"},{"v":0.3,"d":"30%"},4,"低级",{"v":0.1,"d":"10%"},{"v":0.15,"d":"15%"},null,1,"中上",{"v":0.75,"d":"75%"},{"v":0.8,"d":"80%"},{"$nulls":6},"效果命中",null,5,10,10,25,{"$nulls":13},5,86,{"$f":"AM50","v":67},{"$f":"AU15","v":5},{"$f":"AV15+AV26+AV37","v":172},{"$f":"AW15+AW26+AW37","v":133},null,5,{"$f":"AY15","v":172},133,{"$f":"VLOOKUP(BB15,$W$24:$X$42,2,FALSE)","v":"速度"},3,{"$f":"INT(BC15/$BF15)","v":57},{"$f":"INT(BD15/$BF15)","v":44},5,{"$f":"AJ50","v":48},{"$f":"AI50","v":28},{"$f":"BI15","v":5},{"$f":"BJ15+BJ26+BJ37","v":96},{"$f":"BK15+BK26+BK37","v":56},null,5,96,56,3,{"$f":"INT(BQ15/$BF15)","v":32},{"$f":"INT(BR15/$BF15)","v":18},5,67,48,{"$f":"BV15","v":5},{"$f":"BW15+BW26+BW37","v":133},{"$f":"BX15+BX26+BX37","v":96},null,5,133,96,3,{"$f":"INT(CD15/$BF15)","v":44},{"$f":"INT(CE15/$BF15)","v":32},5,{"$f":"AI82","v":100},{"$f":"AJ82","v":117},{"$f":"CI15","v":5},{"$f":"CJ15+CJ39+CJ50","v":200},{"$f":"CK15+CK39+CK50","v":233},{"$f":"CL15","v":5},{"$f":"CM15","v":200},{"$f":"CN15","v":233},3,{"$f":"INT(CP15/CR15)","v":66},{"$f":"INT(CQ15/CR15)","v":77},5,{"$f":"AK82","v":117},{"$f":"AL82","v":134},{"$f":"CU15","v":5},{"$f":"CV15+CV39+CV50","v":233},{"$f":"CW15+CW39+CW50","v":268},{"$f":"CX15","v":5},233,268,3,{"$f":"INT(DB15/$CR15)","v":77},{"$f":"INT(DC15/$CR15)","v":89},{"$f":"VLOOKUP(DA15,$W$24:$X$42,2,FALSE)","v":"速度"},5,134,168,{"$f":"DH15","v":5},{"$f":"DI15+DI39+DI50","v":268},{"$f":"DJ15+DJ39+DJ50","v":336},5,268,336,3,{"$f":"INT(DO15/$CR15)","v":89},{"$f":"INT(DP15/$CR15)","v":112}]
{"$rows_left_out":113}