{"text_format":"3","workbook":"xlsx","n_sheets":6,"sheets":["ActivityRewardConfig","Sheet1","连续充值奖励","累计签到奖励","达人系列","Sheet2"],"not_rendered":{"external_links":2,"defined_names":1,"comments":1},"read":"whole","date_system":"1900"}

{"sheet":"ActivityRewardConfig","index":0,"n_rows":688,"n_cols":13,"rows_kept":688}
[null,"Id","ActivityId","Values","Reward","Sort","Drawing","ExtraParm","TotalValues","MultiplyingPower","ContentsShow","Jump","Nouse"]
[null,"int","int","mut,int#int,2","mut,int#int,2","int","int","int","int","int","string","mut,int#int,1","string"]
[null,2,2,2,2,3,3,3,3,3,3,3,0]
[null,"索引","活动id","参数","奖励","排序","立绘","参数","总价值","价值总倍率","达人文字描述","跳转","备注"]
["默认值"]
["正确性校对"]
["校对值"]
[null,1,56,1,"16#300",1,{"$nulls":4},"大量妖晶",null,"8日奖励"]
[null,2,56,2,"10043#1",2,{"$nulls":4},"5星金将"]
[null,3,56,3,"19#10",3,{"$nulls":4},"十连点将"]
[null,4,56,4,"70034#1",4,{"$nulls":4},"金装宝箱"]
[null,5,56,5,"61#1",5,{"$nulls":4},"高级探宝券"]
[null,6,56,6,"5000011#1",6,{"$nulls":4},"伏羲魂印"]
[null,7,56,7,"19#20",7,{"$nulls":4},"二十连点将"]
[null,8,56,8,"10022#1",8,{"$nulls":4},"5星金将"]
[null,11,1,2,"16#50",1,{"$nulls":4},"七日累计在线2分钟",null,"在线奖励"]
[null,12,1,10,"14#50000",2,{"$nulls":4},"七日累计在线10分钟"]
[null,13,1,15,"3#50000",3,{"$nulls":4},"七日累计在线15分钟"]
[null,14,1,20,"10071#1",4,{"$nulls":4},"七日累计在线20分钟"]
[null,15,1,25,"16#100",5,{"$nulls":4},"七日累计在线25分钟"]
[null,16,1,30,"14#150000",6,{"$nulls":4},"七日累计在线30分钟"]
[null,17,1,40,"3#150000",7,{"$nulls":4},"七日累计在线40分钟"]
[null,18,1,60,"10060#1",8,{"$nulls":4},"七日累计在线60分钟"]
[null,19,1,90,"16#200",9,{"$nulls":4},"七日累计在线90分钟"]
[null,20,1,120,"14#300000",10,{"$nulls":4},"七日累计在线120分钟"]
[null,21,1,150,"3#300000",11,{"$nulls":4},"七日累计在线150分钟"]
[null,22,1,180,"19#5",12,{"$nulls":4},"七日累计在线180分钟"]
["剑影仙踪",30,42,"1|4151","10026#1",1,10026,12013,null,null,"通关简单4-15",26078]
["剑影仙踪",31,42,"2|2","10026#1",1,10026,10043,null,null,"次日登录",15001]
["剑影仙踪",32,42,"3|2","10026#1",1,10026,10037,null,null,"激活豪华月卡",36004]
{"$rows_left_out":659}
{"sheet":"Sheet1","index":1,"n_rows":12,"n_cols":4,"rows_kept":12}
["16#100","14#20000",null,{"$f":"[1]!SUMSTRING(A1:B1,\"|\")","v":{"$error":"#NAME?"}}]
["16#100","3#2000",null,{"$f":"[1]!SUMSTRING(A2:B2,\"|\")","v":{"$error":"#NAME?"}}]
["16#100","14#30000",null,{"$f":"[1]!SUMSTRING(A3:B3,\"|\")","v":{"$error":"#NAME?"}}]
["16#100","3#5000",null,{"$f":"[1]!SUMSTRING(A4:B4,\"|\")","v":{"$error":"#NAME?"}}]
["16#100","14#50000",null,{"$f":"[1]!SUMSTRING(A5:B5,\"|\")","v":{"$error":"#NAME?"}}]
["16#100","3#5000",null,{"$f":"[1]!SUMSTRING(A6:B6,\"|\")","v":{"$error":"#NAME?"}}]
["14#100000","3#5000",null,{"$f":"[1]!SUMSTRING(A7:B7,\"|\")","v":{"$error":"#NAME?"}}]
["2#200","4#500","14#100000",{"$f":"[1]!SUMSTRING(A8:B8,\"|\")","v":{"$error":"#NAME?"}}]
["3#10000","14#100000",null,{"$f":"[1]!SUMSTRING(A9:B9,\"|\")","v":{"$error":"#NAME?"}}]
["19#10","4#600","3#10000",{"$f":"[1]!SUMSTRING(A10:B10,\"|\")","v":{"$error":"#NAME?"}}]
["4#600","19#10","14#151500",{"$f":"[1]!SUMSTRING(A11:B11,\"|\")","v":{"$error":"#NAME?"}}]
["19#10","4#700","3#14700",{"$f":"[1]!SUMSTRING(A12:B12,\"|\")","v":{"$error":"#NAME?"}}]

{"sheet":"连续充值奖励","index":2,"n_rows":17,"n_cols":25,"rows_kept":17}
[]
[null,null,"连续充值","道具",null,"数量",null,"道具",null,"数量",null,"道具",null,"数量",null,null,"价值",null,null,"综合",null,null,"统计",null,"价值"]
[null,null,"第1天","聚灵神戒",19,1,{"$f":"E3&\"#\"&F3","v":"19#1"},"金币",14,10000,{"$f":"I3&\"#\"&J3","v":"14#10000"},"成长护符",3,300,{"$f":"M3&\"#\"&N3","v":"3#300"},{"$f":"_xlfn.TEXTJOIN(\"|\",TRUE,G3,O3,K3)","v":"19#1|3#300|14#10000"},{"$f":"VLOOKUP(D3,[2]Sheet1!$A:$E,5,FALSE)*F3","v":{"$error":"#N/A"}},{"$f":"VLOOKUP(H3,[2]Sheet1!$A:$E,5,FALSE)*J3","v":{"$error":"#N/A"}},{"$f":"VLOOKUP(L3,[2]Sheet1!$A:$E,5,FALSE)*N3","v":{"$error":"#N/A"}},{"$f":"Q3+R3+S3","v":{"$error":"#N/A"}},null,null,"金币",{"$f":"SUM(J3:J18)","v":150000},{"$f":"VLOOKUP(W3,[2]Sheet1!$A:$E,5,FALSE)*X3","v":{"$error":"#N/A"}}]
[null,null,"第2天","妖晶",16,100,{"$f":"E4&\"#\"&F4","v":"16#100"},"金币",14,10000,{"$f":"I4&\"#\"&J4","v":"14#10000"},"成长护符",3,300,"3#300",{"$f":"_xlfn.TEXTJOIN(\"|\",TRUE,G4,O4,K4)","v":"16#100|3#300|14#10000"},{"$f":"VLOOKUP(D4,[2]Sheet1!$A:$E,5,FALSE)*F4","v":{"$error":"#N/A"}},{"$f":"VLOOKUP(H4,[2]Sheet1!$A:$E,5,FALSE)*J4","v":{"$error":"#N/A"}},{"$f":"VLOOKUP(L4,[2]Sheet1!$A:$E,5,FALSE)*N4","v":{"$error":"#N/A"}},{"$error":"#N/A"},null,null,"成长护符",{"$f":"SUM(N3:N17)","v":4500},{"$f":"VLOOKUP(W4,[2]Sheet1!$A:$E,5,FALSE)*X4","v":{"$error":"#N/A"}}]
[null,null,"第3天","灵丹",5,100,"5#100","金币",14,10000,"14#10000","成长护符",3,300,"3#300","5#100|3#300|14#10000",{"$f":"VLOOKUP(D5,[2]Sheet1!$A:$E,5,FALSE)*F5","v":{"$error":"#N/A"}},{"$f":"VLOOKUP(H5,[2]Sheet1!$A:$E,5,FALSE)*J5","v":{"$error":"#N/A"}},{"$f":"VLOOKUP(L5,[2]Sheet1!$A:$E,5,FALSE)*N5","v":{"$error":"#N/A"}},{"$error":"#N/A"},null,null,"聚灵神戒",{"$f":"F3+F9+F14","v":3},{"$f":"VLOOKUP(W5,[2]Sheet1!$A:$E,5,FALSE)*X5","v":{"$error":"#N/A"}}]
[null,null,"第4天","铁矿石",1001,5000,"1001#5000","金币",14,10000,"14#10000","成长护符",3,300,"3#300","1001#5000|3#300|14#10000",{"$f":"VLOOKUP(D6,[2]Sheet1!$A:$E,5,FALSE)*F6","v":{"$error":"#N/A"}},{"$f":"VLOOKUP(H6,[2]Sheet1!$A:$E,5,FALSE)*J6","v":{"$error":"#N/A"}},{"$f":"VLOOKUP(L6,[2]Sheet1!$A:$E,5,FALSE)*N6","v":{"$error":"#N/A"}},{"$error":"#N/A"},null,null,"妖魂魔戒",{"$f":"F11","v":1},{"$f":"VLOOKUP(W6,[2]Sheet1!$A:$E,5,FALSE)*X6","v":{"$error":"#N/A"}}]
[null,null,"第5天","妖晶",16,120,"16#120","金币",14,10000,"14#10000","成长护符",3,300,"3#300","16#120|3#300|14#10000",{"$f":"VLOOKUP(D7,[2]Sheet1!$A:$E,5,FALSE)*F7","v":{"$error":"#N/A"}},{"$f":"VLOOKUP(H7,[2]Sheet1!$A:$E,5,FALSE)*J7","v":{"$error":"#N/A"}},{"$f":"VLOOKUP(L7,[2]Sheet1!$A:$E,5,FALSE)*N7","v":{"$error":"#N/A"}},{"$error":"#N/A"},null,null,"灵丹",{"$f":"F5+F10","v":220},{"$f":"VLOOKUP(W7,[2]Sheet1!$A:$E,5,FALSE)*X7","v":{"$error":"#N/A"}}]
[null,54109,"第6天","紫色装备",1555,1,"1555#1","金币",14,10000,"14#10000","成长护符",3,300,"3#300","1555#1|3#300|14#10000",{"$f":"VLOOKUP(D8,[2]Sheet1!$A:$E,5,FALSE)*F8","v":{"$error":"#N/A"}},{"$f":"VLOOKUP(H8,[2]Sheet1!$A:$E,5,FALSE)*J8","v":{"$error":"#N/A"}},{"$f":"VLOOKUP(L8,[2]Sheet1!$A:$E,5,FALSE)*N8","v":{"$error":"#N/A"}},{"$error":"#N/A"},null,null,"妖晶",{"$f":"F4+F7+F13","v":370},{"$f":"VLOOKUP(W8,[2]Sheet1!$A:$E,5,FALSE)*X8","v":{"$error":"#N/A"}}]
[null,null,"第7天","聚灵神戒",19,1,"19#1","金币",14,10000,"14#10000","成长护符",3,300,"3#300","19#1|3#300|14#10000",{"$f":"VLOOKUP(D9,[2]Sheet1!$A:$E,5,FALSE)*F9","v":{"$error":"#N/A"}},{"$f":"VLOOKUP(H9,[2]Sheet1!$A:$E,5,FALSE)*J9","v":{"$error":"#N/A"}},{"$f":"VLOOKUP(L9,[2]Sheet1!$A:$E,5,FALSE)*N9","v":{"$error":"#N/A"}},{"$error":"#N/A"},null,null,"铁矿石",{"$f":"F6","v":5000},{"$f":"VLOOKUP(W9,[2]Sheet1!$A:$E,5,FALSE)*X9","v":{"$error":"#N/A"}}]
[null,null,"第8天","灵丹",5,120,"5#120","金币",14,10000,"14#10000","成长护符",3,300,"3#300","5#120|3#300|14#10000",{"$f":"VLOOKUP(D10,[2]Sheet1!$A:$E,5,FALSE)*F10","v":{"$error":"#N/A"}},{"$f":"VLOOKUP(H10,[2]Sheet1!$A:$E,5,FALSE)*J10","v":{"$error":"#N/A"}},{"$f":"VLOOKUP(L10,[2]Sheet1!$A:$E,5,FALSE)*N10","v":{"$error":"#N/A"}},{"$error":"#N/A"},null,null,"紫色装备",{"$f":"F11","v":1},{"$f":"VLOOKUP(W10,[2]Sheet1!$A:$E,5,FALSE)*X10","v":{"$error":"#N/A"}}]
[null,null,"第9天","妖魂魔戒",21,1,"21#1","金币",14,10000,"14#10000","成长护符",3,300,"3#300","21#1|3#300|14#10000",{"$f":"VLOOKUP(D11,[2]Sheet1!$A:$E,5,FALSE)*F11","v":{"$error":"#N/A"}},{"$f":"VLOOKUP(H11,[2]Sheet1!$A:$E,5,FALSE)*J11","v":{"$error":"#N/A"}},{"$f":"VLOOKUP(L11,[2]Sheet1!$A:$E,5,FALSE)*N11","v":{"$error":"#N/A"}},{"$error":"#N/A"},null,null,"5星角色碎片",{"$f":"F17+F12+F15","v":25},{"$f":"VLOOKUP(W11,[2]Sheet1!$A:$E,5,FALSE)*X11","v":{"$error":"#N/A"}}]
[null,null,"第10天","5星角色碎片",12013,5,"12013#5","金币",14,10000,"14#10000","成长护符",3,300,"3#300","12013#5|3#300|14#10000",{"$f":"VLOOKUP(D12,[2]Sheet1!$A:$E,5,FALSE)*F12","v":{"$error":"#N/A"}},{"$f":"VLOOKUP(H12,[2]Sheet1!$A:$E,5,FALSE)*J12","v":{"$error":"#N/A"}},{"$f":"VLOOKUP(L12,[2]Sheet1!$A:$E,5,FALSE)*N12","v":{"$error":"#N/A"}},{"$error":"#N/A"},null,null,"橙色装备",1,{"$f":"VLOOKUP(W12,[2]Sheet1!$A:$E,5,FALSE)*X12","v":{"$error":"#N/A"}}]
[null,null,"第11天","妖晶",16,150,"16#150","金币",14,10000,"14#10000","成长护符",3,300,"3#300","16#150|3#300|14#10000",{"$f":"VLOOKUP(D13,[2]Sheet1!$A:$E,5,FALSE)*F13","v":{"$error":"#N/A"}},{"$f":"VLOOKUP(H13,[2]Sheet1!$A:$E,5,FALSE)*J13","v":{"$error":"#N/A"}},{"$f":"VLOOKUP(L13,[2]Sheet1!$A:$E,5,FALSE)*N13","v":{"$error":"#N/A"}},{"$error":"#N/A"}]
[null,null,"第12天","聚灵神戒",19,1,"19#1","金币",14,10000,"14#10000","成长护符",3,300,"3#300","19#1|3#300|14#10000",{"$f":"VLOOKUP(D14,[2]Sheet1!$A:$E,5,FALSE)*F14","v":{"$error":"#N/A"}},{"$f":"VLOOKUP(H14,[2]Sheet1!$A:$E,5,FALSE)*J14","v":{"$error":"#N/A"}},{"$f":"VLOOKUP(L14,[2]Sheet1!$A:$E,5,FALSE)*N14","v":{"$error":"#N/A"}},{"$error":"#N/A"}]
[null,null,"第13天","5星角色碎片",12013,5,"12013#5","金币",14,10000,"14#10000","成长护符",3,300,"3#300","12013#5|3#300|14#10000",{"$f":"VLOOKUP(D15,[2]Sheet1!$A:$E,5,FALSE)*F15","v":{"$error":"#N/A"}},{"$f":"VLOOKUP(H15,[2]Sheet1!$A:$E,5,FALSE)*J15","v":{"$error":"#N/A"}},{"$f":"VLOOKUP(L15,[2]Sheet1!$A:$E,5,FALSE)*N15","v":{"$error":"#N/A"}},{"$error":"#N/A"},null,null,"返利","充值妖晶","获得妖晶"]
[null,null,"第14天","橙色装备",1556,1,"1556#1","金币",14,10000,"14#10000","成长护符",3,300,"3#300","1556#1|3#300|14#10000",{"$f":"VLOOKUP(D16,[2]Sheet1!$A:$E,5,FALSE)*F16","v":{"$error":"#N/A"}},{"$f":"VLOOKUP(H16,[2]Sheet1!$A:$E,5,FALSE)*J16","v":{"$error":"#N/A"}},{"$f":"VLOOKUP(L16,[2]Sheet1!$A:$E,5,FALSE)*N16","v":{"$error":"#N/A"}},{"$error":"#N/A"},null,null,{"$f":"Y16/X16","v":{"$error":"#N/A"}},{"$f":"60*15","v":900},{"$f":"SUM(T3:T17)","v":{"$error":"#N/A"}}]
[null,null,"第15天","5星角色碎片",12013,15,"12013#15","金币",14,10000,"14#10000","成长护符",3,300,"3#300","12013#15|3#300|14#10000",{"$f":"VLOOKUP(D17,[2]Sheet1!$A:$E,5,FALSE)*F17","v":{"$error":"#N/A"}},{"$f":"VLOOKUP(H17,[2]Sheet1!$A:$E,5,FALSE)*J17","v":{"$error":"#N/A"}},{"$f":"VLOOKUP(L17,[2]Sheet1!$A:$E,5,FALSE)*N17","v":{"$error":"#N/A"}},{"$error":"#N/A"},null,null,{"$f":"Y17/X17","v":{"$error":"#N/A"}},{"$f":"120*15","v":1800},{"$f":"SUM(T4:T18)","v":{"$error":"#N/A"}}]

{"sheet":"累计签到奖励","index":3,"n_rows":36,"n_cols":16,"rows_kept":36}
["签到奖励",null,"活动类型"]
["签到奖励养成材料、妖灵师碎片、抽卡券"]
[{"$nulls":12},"投放总量统计",null,"价值"]
[{"$nulls":12},"金币",{"$f":"C6+C8+C13+C15+C20+C22+C27+C29+C34+C36","v":33737},{"$f":"VLOOKUP(M4,[2]Sheet1!$A:$E,5,FALSE)*N4","v":{"$error":"#N/A"}}]
["天数","奖励","数量",null,null,"价值",{"$nulls":6},"成长护符",{"$f":"C7+C14+C21+C28+C35","v":16111},{"$f":"VLOOKUP(M5,[2]Sheet1!$A:$E,5,FALSE)*N5","v":{"$error":"#N/A"}}]
[1,"金币",10000,{"$f":"VLOOKUP(B6,Sheet2!$A:$B,2,FALSE)","v":14},{"$f":"D6&\"#\"&C6","v":"14#10000"},{"$f":"VLOOKUP(B6,[2]Sheet1!$A:$E,5,FALSE)*C6","v":{"$error":"#N/A"}},{"$nulls":6},"梦魇妖壶",{"$f":"C11+C18","v":10005},{"$f":"VLOOKUP(M6,[2]Sheet1!$A:$E,5,FALSE)*N6","v":{"$error":"#N/A"}}]
[2,"成长护符",1000,{"$f":"VLOOKUP(B7,Sheet2!$A:$B,2,FALSE)","v":3},{"$f":"D7&\"#\"&C7","v":"3#1000"},{"$f":"VLOOKUP(B7,[2]Sheet1!$A:$E,5,FALSE)*C7","v":{"$error":"#N/A"}},{"$nulls":6},"灵丹",{"$f":"C10+C17+C24+C31","v":21531},{"$f":"VLOOKUP(M7,[2]Sheet1!$A:$E,5,FALSE)*N7","v":{"$error":"#N/A"}}]
[3,"聚灵神戒",1,{"$f":"VLOOKUP(B8,Sheet2!$A:$B,2,FALSE)","v":19},"19#1",{"$f":"VLOOKUP(B8,[2]Sheet1!$A:$E,5,FALSE)*C8","v":{"$error":"#N/A"}},{"$nulls":6},"铁矿石",{"$f":"C16+C23+C30+C9","v":10140},{"$f":"VLOOKUP(M8,[2]Sheet1!$A:$E,5,FALSE)*N8","v":{"$error":"#N/A"}}]
[4,"灵丹",50,{"$f":"VLOOKUP(B9,Sheet2!$A:$B,2,FALSE)","v":5},"5#50",{"$f":"VLOOKUP(B9,[2]Sheet1!$A:$E,5,FALSE)*C9","v":{"$error":"#N/A"}},{"$nulls":6},"5星角色碎片",{"$f":"C25+C32","v":2050},{"$f":"VLOOKUP(M9,[2]Sheet1!$A:$E,5,FALSE)*N9","v":{"$error":"#N/A"}}]
[5,"梦魇妖壶",30,{"$f":"VLOOKUP(B10,Sheet2!$A:$B,2,FALSE)","v":4},"4#30",{"$f":"VLOOKUP(B10,[2]Sheet1!$A:$E,5,FALSE)*C10","v":{"$error":"#N/A"}},{"$nulls":6},"聚灵神戒",{"$f":"C12+C26","v":16000},{"$f":"VLOOKUP(M10,[2]Sheet1!$A:$E,5,FALSE)*N10","v":{"$error":"#N/A"}}]
[6,"金币",10000,{"$f":"VLOOKUP(B11,Sheet2!$A:$B,2,FALSE)","v":14},"14#10000",{"$f":"VLOOKUP(B11,[2]Sheet1!$A:$E,5,FALSE)*C11","v":{"$error":"#N/A"}},{"$nulls":6},"妖魂魔戒",{"$f":"C19+C33","v":120},{"$f":"VLOOKUP(M11,[2]Sheet1!$A:$E,5,FALSE)*N11","v":{"$error":"#N/A"}}]
[7,"成长护符",1000,{"$f":"VLOOKUP(B12,Sheet2!$A:$B,2,FALSE)","v":3},"3#1000",{"$f":"VLOOKUP(B12,[2]Sheet1!$A:$E,5,FALSE)*C12","v":{"$error":"#N/A"}}]
[8,"5星随机碎片",5,{"$f":"VLOOKUP(B13,Sheet2!$A:$B,2,FALSE)","v":12013},"12013#5",{"$f":"VLOOKUP(B13,[2]Sheet1!$A:$E,5,FALSE)*C13","v":{"$error":"#N/A"}}]
[9,"妖魂魔戒",1,{"$f":"VLOOKUP(B14,Sheet2!$A:$B,2,FALSE)","v":21},"21#1",{"$f":"VLOOKUP(B14,[2]Sheet1!$A:$E,5,FALSE)*C14","v":{"$error":"#N/A"}}]
[10,"梦魇妖壶",30,{"$f":"VLOOKUP(B15,Sheet2!$A:$B,2,FALSE)","v":4},"4#30",{"$f":"VLOOKUP(B15,[2]Sheet1!$A:$E,5,FALSE)*C15","v":{"$error":"#N/A"}}]
[11,"金币",10000,{"$f":"VLOOKUP(B16,Sheet2!$A:$B,2,FALSE)","v":14},"14#10000",{"$f":"VLOOKUP(B16,[2]Sheet1!$A:$E,5,FALSE)*C16","v":{"$error":"#N/A"}},{"$nulls":3},1,2,3,4,5,6,7]
[12,"成长护符",1500,{"$f":"VLOOKUP(B17,Sheet2!$A:$B,2,FALSE)","v":3},"3#1500",{"$f":"VLOOKUP(B17,[2]Sheet1!$A:$E,5,FALSE)*C17","v":{"$error":"#N/A"}},null,null,1,{"$f":"B6","v":"金币"},{"$f":"B7","v":"成长护符"},{"$f":"B8","v":"聚灵神戒"},{"$f":"B9","v":"灵丹"},{"$f":"B10","v":"梦魇妖壶"},{"$f":"B11","v":"金币"},{"$f":"B12","v":"成长护符"}]
[13,"5星随机碎片",5,{"$f":"VLOOKUP(B18,Sheet2!$A:$B,2,FALSE)","v":12013},"12013#5",{"$f":"VLOOKUP(B18,[2]Sheet1!$A:$E,5,FALSE)*C18","v":{"$error":"#N/A"}},null,null,{"$f":"I17+7","v":8},{"$f":"B13","v":"5星随机碎片"},{"$f":"B14","v":"妖魂魔戒"},{"$f":"B15","v":"梦魇妖壶"},{"$f":"B16","v":"金币"},{"$f":"B17","v":"成长护符"},{"$f":"B18","v":"5星随机碎片"},{"$f":"B19","v":"灵丹"}]
[14,"灵丹",100,{"$f":"VLOOKUP(B19,Sheet2!$A:$B,2,FALSE)","v":5},"5#100",{"$f":"VLOOKUP(B19,[2]Sheet1!$A:$E,5,FALSE)*C19","v":{"$error":"#N/A"}},null,null,15,{"$f":"B20","v":"梦魇妖壶"},{"$f":"B21","v":"金币"},{"$f":"B22","v":"成长护符"},{"$f":"B23","v":"5星随机碎片"},{"$f":"B24","v":"妖魂魔戒"},{"$f":"B25","v":"梦魇妖壶"},{"$f":"B26","v":"金币"}]
[15,"梦魇妖壶",50,{"$f":"VLOOKUP(B20,Sheet2!$A:$B,2,FALSE)","v":4},"4#50",{"$f":"VLOOKUP(B20,[2]Sheet1!$A:$E,5,FALSE)*C20","v":{"$error":"#N/A"}},null,null,22,{"$f":"B27","v":"成长护符"},{"$f":"B28","v":"5星随机碎片"},{"$f":"B29","v":"灵丹"},{"$f":"B30","v":"梦魇妖壶"},{"$f":"B31","v":"金币"},{"$f":"B32","v":"成长护符"},{"$f":"B33","v":"5星随机碎片"}]
[16,"金币",15000,{"$f":"VLOOKUP(B21,Sheet2!$A:$B,2,FALSE)","v":14},"14#15000",{"$f":"VLOOKUP(B21,[2]Sheet1!$A:$E,5,FALSE)*C21","v":{"$error":"#N/A"}},null,null,29,{"$f":"B34","v":"妖魂魔戒"},{"$f":"B35","v":"梦魇妖壶"},{"$f":"B36","v":"金币"}]
[17,"成长护符",1500,{"$f":"VLOOKUP(B22,Sheet2!$A:$B,2,FALSE)","v":3},"3#1500",{"$f":"VLOOKUP(B22,[2]Sheet1!$A:$E,5,FALSE)*C22","v":{"$error":"#N/A"}}]
[18,"5星随机碎片",10,{"$f":"VLOOKUP(B23,Sheet2!$A:$B,2,FALSE)","v":12013},"12013#10",{"$f":"VLOOKUP(B23,[2]Sheet1!$A:$E,5,FALSE)*C23","v":{"$error":"#N/A"}}]
[19,"妖魂魔戒",1,{"$f":"VLOOKUP(B24,Sheet2!$A:$B,2,FALSE)","v":21},"21#1",{"$f":"VLOOKUP(B24,[2]Sheet1!$A:$E,5,FALSE)*C24","v":{"$error":"#N/A"}}]
[20,"梦魇妖壶",50,{"$f":"VLOOKUP(B25,Sheet2!$A:$B,2,FALSE)","v":4},"4#50",{"$f":"VLOOKUP(B25,[2]Sheet1!$A:$E,5,FALSE)*C25","v":{"$error":"#N/A"}}]
[21,"金币",15000,{"$f":"VLOOKUP(B26,Sheet2!$A:$B,2,FALSE)","v":14},"14#15000",{"$f":"VLOOKUP(B26,[2]Sheet1!$A:$E,5,FALSE)*C26","v":{"$error":"#N/A"}}]
[22,"成长护符",2000,{"$f":"VLOOKUP(B27,Sheet2!$A:$B,2,FALSE)","v":3},"3#2000",{"$f":"VLOOKUP(B27,[2]Sheet1!$A:$E,5,FALSE)*C27","v":{"$error":"#N/A"}}]
[23,"5星随机碎片",10,{"$f":"VLOOKUP(B28,Sheet2!$A:$B,2,FALSE)","v":12013},"12013#10",{"$f":"VLOOKUP(B28,[2]Sheet1!$A:$E,5,FALSE)*C28","v":{"$error":"#N/A"}}]
[24,"灵丹",150,{"$f":"VLOOKUP(B29,Sheet2!$A:$B,2,FALSE)","v":5},"5#150",{"$f":"VLOOKUP(B29,[2]Sheet1!$A:$E,5,FALSE)*C29","v":{"$error":"#N/A"}}]
[25,"梦魇妖壶",80,{"$f":"VLOOKUP(B30,Sheet2!$A:$B,2,FALSE)","v":4},"4#80",{"$f":"VLOOKUP(B30,[2]Sheet1!$A:$E,5,FALSE)*C30","v":{"$error":"#N/A"}}]
{"$rows_left_out":7}
{"sheet":"达人系列","index":4,"n_rows":37,"n_cols":24,"rows_kept":37}
[]
[null,"妖灵师进阶达人"]
[null,null,"内容","奖励","数量","价值","奖励","数量","价值","奖励","数量","价值",null,"总价值",null,null,"道具"]
[null,null,"合成5星英雄3个","4星随机碎片",10,{"$f":"VLOOKUP(D4,[2]Sheet1!$A:$E,5,FALSE)*E4","v":{"$error":"#N/A"}},"金币",10000,{"$f":"VLOOKUP(G4,[2]Sheet1!$A:$E,5,FALSE)*H4","v":{"$error":"#N/A"}},"成长护符",300,{"$f":"VLOOKUP(J4,[2]Sheet1!$A:$E,5,FALSE)*K4","v":{"$error":"#N/A"}},null,{"$f":"L4+I4+F4","v":{"$error":"#N/A"}},null,{"$f":"R4&\"|\"&X4&\"|\"&U4","v":{"$error":"#N/A"}},{"$f":"ROUND(VLOOKUP(D4,[2]Sheet1!$A:$E,2,FALSE),0)","v":{"$error":"#N/A"}},{"$f":"Q4&\"#\"&E4","v":{"$error":"#N/A"}},null,{"$f":"ROUND(VLOOKUP(G4,[2]Sheet1!$A:$E,2,FALSE),0)","v":{"$error":"#N/A"}},{"$f":"T4&\"#\"&H4","v":{"$error":"#N/A"}},null,{"$f":"ROUND(VLOOKUP(J4,[2]Sheet1!$A:$E,2,FALSE),0)","v":{"$error":"#N/A"}},{"$f":"W4&\"#\"&K4","v":{"$error":"#N/A"}}]
[null,null,"合成5星英雄4个","4星随机碎片",15,{"$f":"VLOOKUP(D5,[2]Sheet1!$A:$E,5,FALSE)*E5","v":{"$error":"#N/A"}},"金币",10000,{"$f":"VLOOKUP(G5,[2]Sheet1!$A:$E,5,FALSE)*H5","v":{"$error":"#N/A"}},"成长护符",300,{"$f":"VLOOKUP(J5,[2]Sheet1!$A:$E,5,FALSE)*K5","v":{"$error":"#N/A"}},null,{"$f":"L5+I5+F5","v":{"$error":"#N/A"}},null,{"$f":"R5&\"|\"&X5&\"|\"&U5","v":{"$error":"#N/A"}},{"$f":"ROUND(VLOOKUP(D5,[2]Sheet1!$A:$E,2,FALSE),0)","v":{"$error":"#N/A"}},{"$f":"Q5&\"#\"&E5","v":{"$error":"#N/A"}},null,{"$f":"ROUND(VLOOKUP(G5,[2]Sheet1!$A:$E,2,FALSE),0)","v":{"$error":"#N/A"}},{"$f":"T5&\"#\"&H5","v":{"$error":"#N/A"}},null,{"$f":"ROUND(VLOOKUP(J5,[2]Sheet1!$A:$E,2,FALSE),0)","v":{"$error":"#N/A"}},{"$f":"W5&\"#\"&K5","v":{"$error":"#N/A"}}]
[null,null,"合成5星英雄5个","4星随机碎片",25,{"$f":"VLOOKUP(D6,[2]Sheet1!$A:$E,5,FALSE)*E6","v":{"$error":"#N/A"}},"金币",10000,{"$f":"VLOOKUP(G6,[2]Sheet1!$A:$E,5,FALSE)*H6","v":{"$error":"#N/A"}},"成长护符",300,{"$f":"VLOOKUP(J6,[2]Sheet1!$A:$E,5,FALSE)*K6","v":{"$error":"#N/A"}},null,{"$error":"#N/A"},null,{"$error":"#N/A"},{"$f":"ROUND(VLOOKUP(D6,[2]Sheet1!$A:$E,2,FALSE),0)","v":{"$error":"#N/A"}},{"$error":"#N/A"},null,{"$f":"ROUND(VLOOKUP(G6,[2]Sheet1!$A:$E,2,FALSE),0)","v":{"$error":"#N/A"}},{"$error":"#N/A"},null,{"$f":"ROUND(VLOOKUP(J6,[2]Sheet1!$A:$E,2,FALSE),0)","v":{"$error":"#N/A"}},{"$error":"#N/A"}]
[null,null,"合成5星英雄6个","4星随机碎片",30,{"$f":"VLOOKUP(D7,[2]Sheet1!$A:$E,5,FALSE)*E7","v":{"$error":"#N/A"}},"金币",10000,{"$f":"VLOOKUP(G7,[2]Sheet1!$A:$E,5,FALSE)*H7","v":{"$error":"#N/A"}},"成长护符",300,{"$f":"VLOOKUP(J7,[2]Sheet1!$A:$E,5,FALSE)*K7","v":{"$error":"#N/A"}},null,{"$error":"#N/A"},null,{"$error":"#N/A"},{"$f":"ROUND(VLOOKUP(D7,[2]Sheet1!$A:$E,2,FALSE),0)","v":{"$error":"#N/A"}},{"$error":"#N/A"},null,{"$f":"ROUND(VLOOKUP(G7,[2]Sheet1!$A:$E,2,FALSE),0)","v":{"$error":"#N/A"}},{"$error":"#N/A"},null,{"$f":"ROUND(VLOOKUP(J7,[2]Sheet1!$A:$E,2,FALSE),0)","v":{"$error":"#N/A"}},{"$error":"#N/A"}]
[null,null,"合成6星英雄1个","5星随机碎片",10,{"$f":"VLOOKUP(D8,[2]Sheet1!$A:$E,5,FALSE)*E8","v":{"$error":"#N/A"}},"金币",20000,{"$f":"VLOOKUP(G8,[2]Sheet1!$A:$E,5,FALSE)*H8","v":{"$error":"#N/A"}},"成长护符",600,{"$f":"VLOOKUP(J8,[2]Sheet1!$A:$E,5,FALSE)*K8","v":{"$error":"#N/A"}},null,{"$error":"#N/A"},null,{"$error":"#N/A"},{"$f":"ROUND(VLOOKUP(D8,[2]Sheet1!$A:$E,2,FALSE),0)","v":{"$error":"#N/A"}},{"$error":"#N/A"},null,{"$f":"ROUND(VLOOKUP(G8,[2]Sheet1!$A:$E,2,FALSE),0)","v":{"$error":"#N/A"}},{"$error":"#N/A"},null,{"$f":"ROUND(VLOOKUP(J8,[2]Sheet1!$A:$E,2,FALSE),0)","v":{"$error":"#N/A"}},{"$error":"#N/A"}]
[null,null,"合成6星英雄2个","5星随机碎片",15,{"$f":"VLOOKUP(D9,[2]Sheet1!$A:$E,5,FALSE)*E9","v":{"$error":"#N/A"}},"金币",20000,{"$f":"VLOOKUP(G9,[2]Sheet1!$A:$E,5,FALSE)*H9","v":{"$error":"#N/A"}},"成长护符",600,{"$f":"VLOOKUP(J9,[2]Sheet1!$A:$E,5,FALSE)*K9","v":{"$error":"#N/A"}},null,{"$error":"#N/A"},null,{"$error":"#N/A"},{"$f":"ROUND(VLOOKUP(D9,[2]Sheet1!$A:$E,2,FALSE),0)","v":{"$error":"#N/A"}},{"$error":"#N/A"},null,{"$f":"ROUND(VLOOKUP(G9,[2]Sheet1!$A:$E,2,FALSE),0)","v":{"$error":"#N/A"}},{"$error":"#N/A"},null,{"$f":"ROUND(VLOOKUP(J9,[2]Sheet1!$A:$E,2,FALSE),0)","v":{"$error":"#N/A"}},{"$error":"#N/A"}]
[null,null,"合成6星英雄3个","5星随机碎片",25,{"$f":"VLOOKUP(D10,[2]Sheet1!$A:$E,5,FALSE)*E10","v":{"$error":"#N/A"}},"金币",20000,{"$f":"VLOOKUP(G10,[2]Sheet1!$A:$E,5,FALSE)*H10","v":{"$error":"#N/A"}},"成长护符",600,{"$f":"VLOOKUP(J10,[2]Sheet1!$A:$E,5,FALSE)*K10","v":{"$error":"#N/A"}},null,{"$error":"#N/A"},null,{"$error":"#N/A"},{"$f":"ROUND(VLOOKUP(D10,[2]Sheet1!$A:$E,2,FALSE),0)","v":{"$error":"#N/A"}},{"$error":"#N/A"},null,{"$f":"ROUND(VLOOKUP(G10,[2]Sheet1!$A:$E,2,FALSE),0)","v":{"$error":"#N/A"}},{"$error":"#N/A"},null,{"$f":"ROUND(VLOOKUP(J10,[2]Sheet1!$A:$E,2,FALSE),0)","v":{"$error":"#N/A"}},{"$error":"#N/A"}]
[null,null,"合成7星英雄1个","慕容子期",1,8000,"金币",30000,{"$f":"VLOOKUP(G11,[2]Sheet1!$A:$E,5,FALSE)*H11","v":{"$error":"#N/A"}},"成长护符",1000,{"$f":"VLOOKUP(J11,[2]Sheet1!$A:$E,5,FALSE)*K11","v":{"$error":"#N/A"}},null,{"$error":"#N/A"},null,{"$error":"#N/A"},{"$f":"ROUND(VLOOKUP(D11,[2]Sheet1!$A:$E,2,FALSE),0)","v":{"$error":"#N/A"}},{"$error":"#N/A"},null,{"$f":"ROUND(VLOOKUP(G11,[2]Sheet1!$A:$E,2,FALSE),0)","v":{"$error":"#N/A"}},{"$error":"#N/A"},null,{"$f":"ROUND(VLOOKUP(J11,[2]Sheet1!$A:$E,2,FALSE),0)","v":{"$error":"#N/A"}},{"$error":"#N/A"}]
[]
[]
[null,"急速探险达人"]
[null,null,"内容","奖励","数量","价值","奖励","数量","价值","奖励","数量","价值",null,"总价值",{"$nulls":3},"玩家投入","消耗","实际每档消耗"]
[null,null,"急速探险次数达到5","灵丹",50,{"$f":"ROUND(VLOOKUP(D16,[2]Sheet1!$A:$E,5,FALSE)*E16,0)","v":{"$error":"#N/A"}},"金币",10000,{"$f":"ROUND(VLOOKUP(G16,[2]Sheet1!$A:$E,5,FALSE)*H16,0)","v":{"$error":"#N/A"}},"成长护符",300,{"$f":"VLOOKUP(J16,[2]Sheet1!$A:$E,5,FALSE)*K16","v":{"$error":"#N/A"}},null,{"$f":"L16+I16+F16","v":{"$error":"#N/A"}},"第1次","免费",null,5,{"$f":"R16*100-100","v":400},{"$f":"S16","v":400}]
[null,null,"急速探险次数达到10","梦魇妖壶",50,{"$f":"ROUND(VLOOKUP(D17,[2]Sheet1!$A:$E,5,FALSE)*E17,0)","v":{"$error":"#N/A"}},"金币",10000,{"$f":"ROUND(VLOOKUP(G17,[2]Sheet1!$A:$E,5,FALSE)*H17,0)","v":{"$error":"#N/A"}},"成长护符",300,{"$f":"VLOOKUP(J17,[2]Sheet1!$A:$E,5,FALSE)*K17","v":{"$error":"#N/A"}},null,{"$f":"L17+I17+F17","v":{"$error":"#N/A"}},"第2次",100,null,10,{"$f":"R17*100-100","v":900},{"$f":"S17-S16","v":500},null,"实际消耗","实际获得","返利比"]
[null,null,"急速探险次数达到15","灵丹",100,{"$f":"ROUND(VLOOKUP(D18,[2]Sheet1!$A:$E,5,FALSE)*E18,0)","v":{"$error":"#N/A"}},"金币",10000,{"$f":"ROUND(VLOOKUP(G18,[2]Sheet1!$A:$E,5,FALSE)*H18,0)","v":{"$error":"#N/A"}},"成长护符",300,{"$f":"VLOOKUP(J18,[2]Sheet1!$A:$E,5,FALSE)*K18","v":{"$error":"#N/A"}},null,{"$error":"#N/A"},"第3次",100,null,15,1400,{"$f":"S18-S17","v":500},null,{"$f":"SUM(T16:T24)","v":4900},{"$f":"SUM(F16:F24)","v":{"$error":"#N/A"}},{"$f":"V18/W18","v":{"$error":"#N/A"}}]
[null,null,"急速探险次数达到20","梦魇妖壶",100,{"$f":"ROUND(VLOOKUP(D19,[2]Sheet1!$A:$E,5,FALSE)*E19,0)","v":{"$error":"#N/A"}},"金币",10000,{"$f":"ROUND(VLOOKUP(G19,[2]Sheet1!$A:$E,5,FALSE)*H19,0)","v":{"$error":"#N/A"}},"成长护符",300,{"$f":"VLOOKUP(J19,[2]Sheet1!$A:$E,5,FALSE)*K19","v":{"$error":"#N/A"}},null,{"$error":"#N/A"},"第4次",100,null,20,1900,500]
[null,null,"急速探险次数达到25","铁矿石",5000,{"$f":"ROUND(VLOOKUP(D20,[2]Sheet1!$A:$E,5,FALSE)*E20,0)","v":{"$error":"#N/A"}},"金币",20000,{"$f":"ROUND(VLOOKUP(G20,[2]Sheet1!$A:$E,5,FALSE)*H20,0)","v":{"$error":"#N/A"}},"成长护符",600,{"$f":"VLOOKUP(J20,[2]Sheet1!$A:$E,5,FALSE)*K20","v":{"$error":"#N/A"}},null,{"$error":"#N/A"},{"$nulls":3},25,2400,500]
[null,null,"急速探险次数达到30","5星随机碎片",10,{"$f":"VLOOKUP(D21,[2]Sheet1!$A:$E,5,FALSE)*E21","v":{"$error":"#N/A"}},"金币",20000,{"$f":"ROUND(VLOOKUP(G21,[2]Sheet1!$A:$E,5,FALSE)*H21,0)","v":{"$error":"#N/A"}},"成长护符",600,{"$f":"VLOOKUP(J21,[2]Sheet1!$A:$E,5,FALSE)*K21","v":{"$error":"#N/A"}},null,{"$error":"#N/A"},null,{"$f":"SUM(P17:P19)","v":300},null,30,2900,500]
[null,null,"急速探险次数达到35","5星随机碎片",15,{"$f":"VLOOKUP(D22,[2]Sheet1!$A:$E,5,FALSE)*E22","v":{"$error":"#N/A"}},"金币",20000,{"$f":"ROUND(VLOOKUP(G22,[2]Sheet1!$A:$E,5,FALSE)*H22,0)","v":{"$error":"#N/A"}},"成长护符",600,{"$f":"VLOOKUP(J22,[2]Sheet1!$A:$E,5,FALSE)*K22","v":{"$error":"#N/A"}},null,{"$error":"#N/A"},{"$nulls":3},35,3400,500]
[null,null,"急速探险次数达到40","5星随机碎片",25,{"$f":"VLOOKUP(D23,[2]Sheet1!$A:$E,5,FALSE)*E23","v":{"$error":"#N/A"}},"金币",30000,{"$f":"ROUND(VLOOKUP(G23,[2]Sheet1!$A:$E,5,FALSE)*H23,0)","v":{"$error":"#N/A"}},"成长护符",1000,{"$f":"VLOOKUP(J23,[2]Sheet1!$A:$E,5,FALSE)*K23","v":{"$error":"#N/A"}},null,{"$error":"#N/A"},{"$nulls":3},40,3900,500]
[null,null,"急速探险次数达到50","云灵",1,8000,"金币",50000,{"$f":"ROUND(VLOOKUP(G24,[2]Sheet1!$A:$E,5,FALSE)*H24,0)","v":{"$error":"#N/A"}},"成长护符",3000,{"$f":"VLOOKUP(J24,[2]Sheet1!$A:$E,5,FALSE)*K24","v":{"$error":"#N/A"}},null,{"$error":"#N/A"},{"$nulls":3},50,4900,1000]
[]
[]
[]
[{"$nulls":6},"道具"]
[{"$nulls":5},{"$f":"H29&\"|\"&N29&\"|\"&K29","v":{"$error":"#N/A"}},{"$f":"ROUND(VLOOKUP(D16,[2]Sheet1!$A:$E,2,FALSE),0)","v":{"$error":"#N/A"}},{"$f":"G29&\"#\"&E16","v":{"$error":"#N/A"}},null,{"$f":"ROUND(VLOOKUP(G16,[2]Sheet1!$A:$E,2,FALSE),0)","v":{"$error":"#N/A"}},{"$f":"J29&\"#\"&H16","v":{"$error":"#N/A"}},null,{"$f":"ROUND(VLOOKUP(J16,[2]Sheet1!$A:$E,2,FALSE),0)","v":{"$error":"#N/A"}},{"$f":"M29&\"#\"&K16","v":{"$error":"#N/A"}}]
[{"$nulls":5},{"$f":"H30&\"|\"&N30&\"|\"&K30","v":{"$error":"#N/A"}},{"$f":"ROUND(VLOOKUP(D17,[2]Sheet1!$A:$E,2,FALSE),0)","v":{"$error":"#N/A"}},{"$f":"G30&\"#\"&E17","v":{"$error":"#N/A"}},null,{"$f":"ROUND(VLOOKUP(G17,[2]Sheet1!$A:$E,2,FALSE),0)","v":{"$error":"#N/A"}},{"$f":"J30&\"#\"&H17","v":{"$error":"#N/A"}},null,{"$f":"ROUND(VLOOKUP(J17,[2]Sheet1!$A:$E,2,FALSE),0)","v":{"$error":"#N/A"}},{"$f":"M30&\"#\"&K17","v":{"$error":"#N/A"}}]
{"$rows_left_out":8}
{"sheet":"Sheet2","index":5,"n_rows":1734,"n_cols":2,"rows_kept":1734}
["Name","Id"]
["string","int"]
[2,2]
["道具名","道具id"]
[{"$f":"\"\"","v":""},0]
[]
[]
["行动力",1]
["体力",2]
["成长护符",3]
["梦魇妖壶",4]
["灵丹",5]
["归元髓液",6]
["金币",14]
["魂晶",15]
["妖晶",16]
["经验(玩家)",17]
["vip经验",18]
["聚灵神戒",19]
["元素神戒",20]
["妖魂魔戒",21]
["妖灵玉",22]
["挑战券",23]
["荣耀徽章",24]
["精英证明",25]
["心火明晶",26]
["普通入场券",27]
["精英入场券",28]
["深渊魔石",29]
["远古妖魂宝箱",30]
{"$rows_left_out":1704}