{"text_format":"3","workbook":"xlsx","n_sheets":4,"sheets":["TaskConfig","Sheet1","任务类型表","任务数值表"],"not_rendered":{"external_links":1,"defined_names":1,"comments":4},"read":"whole","date_system":"1900"}

{"sheet":"TaskConfig","index":0,"n_rows":59,"n_cols":8,"rows_kept":59}
[null,"Id","TaskType","TaskValue","Desc","Reward","Jump","Nouse"]
[null,"int","int","mut,int#int,2","string","mut,int#int,2","mut,int#int,1","string"]
[null,2,2,2,3,2,2,0]
[null,"任务id","任务类型","任务参数","任务描述","任务奖励\n物品id#数量","跳转","跳转备注"]
["默认值"]
["正确性校对"]
["校对值"]
[null,10011,14,"1031|1","通关故事关卡：简单1-3","16#20",26078]
[null,10012,1,"0|2","进行2次神将召唤","16#20",1023]
[null,10013,3,"20|1","一个神将等级达到20级","16#20",22001]
[null,10014,9,"0|3","玩家等级达到：3级","16#20",26078]
[null,10021,14,"1201|1","通关故事关卡：简单1-20","16#30",26078]
[null,10022,9,"0|15","玩家等级达到：15级","16#30",26078]
[null,10023,77,"0|3","刷新天宫寻宝3次","16#30",60001]
[null,10024,57,"0|5","完成心魔试炼：第5波","16#30",1011]
[null,10031,14,"4101|1","通关故事关卡：简单4-10","16#30",26078]
[null,10032,10,"0|60000","玩家战力达到：60000","16#30",22001]
[null,10033,77,"0|10","刷新天宫寻宝10次","16#30",60001]
[null,10034,57,"0|15","完成心魔试炼：第15波","16#30",1011]
[null,10041,14,"5201|1","通关故事关卡：简单5-20","16#40",26078]
[null,10042,10,"0|100000","玩家战力达到：100000","16#40",22001]
[null,10043,76,"5|1","接取金色品质的寻宝：1次","16#40",60001]
[null,10044,57,"0|30","完成心魔试炼：第30波","16#40",1011]
[null,10051,14,"7101|1","通关故事关卡：简单7-10","16#40",26078]
[null,10052,10,"0|170000","玩家战力达到：170000","16#40",22001]
[null,10053,76,"5|3","接取金色品质的寻宝：3次","16#40",60001]
[null,10054,57,"0|50","完成心魔试炼：第50波","16#40",1011]
[null,10061,14,"8201|1","通关故事关卡：简单8-20","16#50",26078]
[null,10062,10,"0|320000","玩家战力达到：320000","16#50",22001]
[null,10063,76,"5|6","接取金色品质的寻宝：6次","16#50",60001]
[null,10064,57,"0|70","完成心魔试炼：第70波","16#50",1011]
[null,10071,14,"10101|1","通关故事关卡：简单10-10","16#50",26078]
[null,10072,10,"0|600000","玩家战力达到：600000","16#50",22001]
[null,10073,76,"5|10","接取金色品质的寻宝：10次","16#50",60001]
[null,10074,57,"0|100","完成心魔试炼：第100波","16#50",1011]
[null,10081,14,"12101|1","通关故事关卡：简单12-10","16#60",26078]
[null,10082,10,"0|1150000","玩家战力达到：1150000","16#60",22001]
[null,10083,76,"5|20","接取金色品质的寻宝：20次","16#60",60001]
[null,10084,57,"0|140","完成心魔试炼：第140波","16#60",1011]
[null,10091,14,"14151|1","通关故事关卡：简单14-15","16#60",26078]
[null,10092,10,"0|2000000","玩家战力达到：2000000","16#60",22001]
[null,10093,76,"5|30","接取金色品质的寻宝：30次","16#60",60001]
[null,10094,57,"0|200","完成心魔试炼：第200波","16#60",1011]
[null,10101,14,"1252|1","通关故事关卡：普通1-25","16#70",26078]
[null,10102,10,"0|3000000","玩家战力达到：3000000","16#70",22001]
[null,10103,76,"5|50","接取金色品质的寻宝：50次","16#70",60001]
[null,10104,57,"0|300","完成锁妖塔兽潮来袭：第300波","16#70",1011]
[null,10111,14,"3202|1","通关故事关卡：普通3-20","16#80",26078]
[null,10112,10,"0|4500000","玩家战力达到：4500000","16#80",22001]
[null,10113,76,"5|90","接取金色品质的寻宝：90次","16#80",60001]
[null,10114,57,"0|380","完成心魔试炼：第380波","16#80",1011]
[null,10121,14,"5202|1","通关故事关卡：普通5-20","16#90",26078]
[null,10122,10,"0|5900000","玩家战力达到：5900000","16#90",22001]
[null,10123,76,"5|120","接取金色品质的寻宝：120次","16#90",60001]
[null,10124,57,"0|480","完成心魔试炼：第480波","16#90",1011]
[null,10131,14,"7302|1","通关故事关卡：普通7-30","16#100",26078]
[null,10132,10,"0|7700000","玩家战力达到：7700000","16#100",22001]
[null,10133,76,"5|180","接取金色品质的寻宝：180次","16#100",60001]
[null,10134,57,"0|570","完成心魔试炼：第570波","16#100",1011]

{"sheet":"Sheet1","index":1,"n_rows":82,"n_cols":25,"rows_kept":82}
[]
[null,"Id","TaskType","TaskValue",null,"Desc","Reward","Jump"]
[null,"int","int","mut,int#int,2",null,"string","mut,int#int,1","mut,int#int,1"]
[null,2,2,2,null,3,2,2]
[null,"任务id","任务类型","任务参数",null,"任务描述","任务奖励","跳转","参数","vip等级"]
["默认值"]
["正确性校对",{"$nulls":11},"条件1",null,null,"条件2",null,null,"条件3",null,null,"条件4",null,null,"条件5"]
["校对值",{"$nulls":10},"vip1","妖灵师等级达到15级",null,null,"通关普通副本2",null,null,"玩家战力达到10000"]
[null,100,1,{"$f":"E9&\"#\"&I9","v":"0#15"},0,"妖灵师等级达到：%s","4#1000",null,15,1,null,"vip2","穿戴6件绿色装备",null,null,"5个妖灵师等级达到40",null,null,"通关英雄本1",null,null,"玩家战力达到多少"]
[null,200,2,{"$f":"E10&\"#\"&I10","v":"102#1"},102,"通关普通副本：%s","4#1001",null,1,1,null,"vip3","竞技场挑战多少场",null,null,"获得一件多少评分的装备",null,null,"5个妖灵师等级达到60",null,null,"群英招募多少次",null,null,"通关英雄本2"]
[null,300,3,"0#10000",0,"玩家战力达到：%s","4#1002",null,10000,1,null,"vip4","激活任意一套异妖",null,null,"获得多少个5星妖灵师",null,null,"外地入侵击杀多少次",null,null,"锻造等级达到多少",null,null,"玩家战力达到"]
[null,400,4,"2#6",2,"穿戴%s品质装备数量：%s","4#1003",null,6,2,null,"vip5","穿戴多少件蓝色装备",null,null,"多少个妖灵师达到多少级",null,null,"通关英雄本",null,null,"玩家等级达到多少",null,null,"竞技场积分达到多少"]
[null,500,5,"40#5",40,"妖灵师等级达到%s的数量：%s","4#1004",null,5,2,null,"vip6","穿戴多少件紫色装备",null,null,"通关普通副本",null,null,"异妖总战力达到多少",null,null,"群英招募多少次",null,null,"外地入侵击杀多少次"]
[null,600,6,"202#1",202,"通关英雄副本：%s","4#1005",null,1,2,null,"vip7","穿戴多少个橙色装备",null,null,"激活多少个异妖",null,null,"锻造等级达到多少",null,null,"多少个妖灵师等级达到",null,null,"玩家战力达到"]
[null,700,7,"0#30000",0,"玩家战力达到：%s","4#1006",null,30000,2,null,"vip8","获取多少件评分多少的装备、",null,null,"通关英雄本",null,null,"竞技场积分达到多少",null,null,"累计抽取秘盒多少次",null,null,"异妖总战力达到多少"]
[null,800,8,"0#20",0,"竞技场挑战场数：%s","4#1007",null,20,3,null,"vip9"]
[null,900,9,"5000#1",5000,"获得%s评分的装备数量：%s","4#1008",null,1,{"$f":"J16","v":3},null,"vip10"]
[null,1000,10,"60#5",60,"妖灵师等级达到%s的数量：%s","4#1009",null,5,{"$f":"J17","v":3},null,"vip11"]
[null,1100,11,"0#50",0,"群英征募的次数：%s","4#1010",null,50,{"$f":"J18","v":3},null,"vip12"]
[null,1200,12,"203#1",203,"通关英雄副本：%s","4#1011",null,1,{"$f":"J19","v":3},null,"vip13"]
[null,1300,13,{"$f":"E21&\"#\"&I21","v":"0#1"},0,"激活异妖的数量：%s","4#1012",null,1,{"$f":"J16+1","v":4}]
[null,1400,14,"5#5",5,"获得%s品质妖灵师数量：%s","4#1013",null,5,{"$f":"J17+1","v":4}]
[null,1500,15,"0#8",0,"外敌入侵击杀次数：%s","4#1014",null,8,{"$f":"J18+1","v":4}]
[null,1600,16,"0#5",0,"炼造等级达到：%s","4#1015",null,5,{"$f":"J19+1","v":4}]
[null,1700,17,"0#100000",0,"玩家战力达到：%s","4#1016",null,100000,{"$f":"J20+1","v":4}]
[null,1800,18,"3#12",3,"穿戴%s品质装备数量：%s","4#1017",null,12,{"$f":"J21+1","v":5}]
[null,1900,19,"80#5",80,"妖灵师等级达到%s的数量：%s","4#1000",null,5,5]
[null,{"$f":"B27+100","v":2000},20,"206#1",206,"通关英雄副本：%s","4#1001",null,1,5]
[null,{"$f":"B28+100","v":2100},21,"0#90",0,"玩家等级达到：%s","4#1002",null,90,5]
[null,2200,22,"0#1500",0,"竞技场目标积分：%s","4#1003",null,1500,5]
[null,2300,23,"4#15",4,"穿戴%s品质装备数量：%s","4#1004",null,15,6]
[null,2400,24,"215#1",215,"通关普通副本：%s","4#1005",null,1,6]
[null,2500,25,"0#80000",0,"异妖总战力达到：%s","4#1006",null,80000,6]
[null,2600,26,"0#150",0,"群英征募的次数：%s","4#1007",null,150,6]
[null,2700,27,"0#50",0,"外敌入侵击杀次数：%s","4#1008",null,50,6]
[null,2800,28,"5#15",5,"穿戴%s品质装备数量：%s","4#1009",null,15,7]
[null,2900,29,"0#5",0,"激活异妖数量：%s","4#1010",null,5,7]
[null,3000,30,"0#15",0,"炼造等级达到：%s","4#1011",null,15,7]
[null,3100,31,"100#10",100,"妖灵师等级达到%s的数量：%s","4#1012",null,10,7]
[null,3200,32,"0#200000",0,"玩家战力达到：%s","4#1013",null,200000,7]
[null,3300,33,"10000#8",10000,"获得%s评分的装备数量：%s","4#1014",null,8,8]
[null,3400,34,"209#1",209,"通关英雄副本：%s","4#1015",null,1,8]
[null,3500,35,"0#3000",0,"竞技场目标积分：%s","4#1016",null,3000,8]
[null,3600,36,"0#300",0,"累计秘盒抽取次数：%s","4#1017",null,300,8]
[null,3700,37,"0#150000",0,"异妖总战力达到：%s","4#1017",null,150000,8]
[null,{"$f":"B45+100","v":3800},38,"0#15",0,"妖灵师等级达到：%s","4#1000",null,15,{"$f":"J41+1","v":9}]
[null,3900,39,"102#1",102,"通关普通副本：%s","4#1001",null,1,9]
[null,4000,40,"0#10000",0,"玩家战力达到：%s","4#1002",null,10000,9]
[null,4100,41,"2#6",2,"穿戴%s品质装备数量：%s","4#1003",null,6,9]
[null,4200,42,"40#5",40,"妖灵师等级达到%s的数量：%s","4#1004",null,5,9]
[null,4300,43,"202#1",202,"通关英雄副本：%s","4#1005",null,1,10]
[null,4400,44,"0#30000",0,"玩家战力达到：%s","4#1006",null,30000,10]
[null,4500,45,"0#20",0,"竞技场挑战场数：%s","4#1007",null,20,10]
[null,4600,46,"5000#1",5000,"获得%s评分的装备数量：%s","4#1008",null,1,10]
[null,4700,47,"60#5",60,"妖灵师等级达到%s的数量：%s","4#1009",null,5,10]
[null,4800,48,"0#50",0,"群英征募的次数：%s","4#1010",null,50,11]
[null,4900,49,"203#1",203,"通关英雄副本：%s","4#1011",null,1,11]
[null,5000,50,"0#1",0,"激活异妖的数量：%s","4#1012",null,1,11]
[null,5100,51,"5#5",5,"获得%s品质妖灵师数量：%s","4#1013",null,5,11]
[null,5200,52,"0#8",0,"外敌入侵击杀次数：%s","4#1014",null,8,{"$f":"J55+1","v":11}]
{"$rows_left_out":23}
{"sheet":"任务类型表","index":2,"n_rows":107,"n_cols":12,"rows_kept":107}
[null,"Id","TaskType","TaskValue","Desc","Reward","Jump",{"$nulls":3},"开启条件"]
[null,"int","int","mut,int#int,1","string","mut,int#int,1","mut,int#int,1",{"$nulls":3},"mut,int#int,1"]
[null,2,2,2,3,2,2]
[null,"任务id","任务类型","任务参数","任务描述","任务奖励","跳转"]
["默认值"]
["正确性校对"]
["校对值"]
[null,100,1,"0|10","神将召唤次数达到：%s","4#1000",null,"神将召唤次数达到：",null,null,"65#1",{"$f":"RIGHT(K8,LEN(K8)-FIND(\"#\",K8))","v":"1"}]
[null,200,2,"5|1","获得%s品质神将数量达到：%s","4#1001",null,"获得%s品质神将数量达到：","只记录抽卡原始获得",null,"65#1",{"$f":"RIGHT(K9,LEN(K9)-FIND(\"#\",K9))","v":"1"}]
[null,300,3,"100|2","神将等级达到%s级的数量为：%s","4#1002",null,"神将等级达到%s级的数量为：",null,null,"65#1","1"]
[null,400,4,"0|2","激活异妖数量达到：%s","4#1003",null,"激活异妖数量达到：",null,null,"65#3","3"]
[null,500,5,"0|9000","任意异妖战力达到：%s","4#1004",null,"任意异妖战力达到：",null,null,"65#3","3"]
[null,600,6,"0|900000","异妖总战力达到：%s","4#1005",null,"异妖总战力达到：",null,null,"65#3","3"]
[null,700,7,"0|10","竞技场挑战场次达到：%s","4#1006",null,"竞技场挑战场次达到：",null,null,"65#8","8"]
[null,800,8,"0|1300","竞技场目标积分达到：%s","4#1007",null,"竞技场目标积分达到：",null,null,"65#8","8"]
[null,900,9,"0|20","玩家等级达到：%s","4#1008",null,"玩家等级达到：",null,null,"65#1","1"]
[null,1000,10,"0|9999","玩家战力达到：%s","4#1009",null,"玩家战力达到：",null,null,"65#1","1"]
[null,1100,11,"16|50","累计消耗妖晶达到：%s","4#1010",null,"累计消耗妖晶达到：",null,null,"65#1","1"]
[null,1200,12,"0|4","锻造炉等级达到：%s","4#1011",null,"锻造炉等级达到：",null,null,"65#66","66"]
[null,1300,13,"5|1","获得%s品质装备数量达到：%s","4#1012",null,"获得%s品质装备数量达到：",null,null,"65#20","20"]
[null,1400,14,"3051|1","通关故事关卡：%s","4#1013",null,"通关故事关卡：",null,null,"65#26","26"]
[null,1500,15,"102|1","通关普通副本：%s","4#1014",null,"通关普通副本：",null,null,"65#26","26"]
[null,1600,16,"1#301|1","通关简单难度精英副本：古寺疑云","4#1015",null,"通关难度%s英雄副本：",null,null,"65#26","26"]
[null,1700,17,"0|2","外敌入侵击杀次数达到：%s","4#1016",null,"外敌入侵击杀次数达到：",null,null,"65#26","26"]
[null,1800,18,"0|10","累计抽取秘盒次数达到：%s","4#1017",null,"累计抽取秘盒次数达到：",null,null,"65#21","21"]
[null,1900,19,"1500|1","获得%s战力的装备件数达到：%s","4#1000",null,"获得%s战力的装备件数达到：",null,null,"65#20","20"]
[null,2000,20,"0|1","买金币次数达到",null,null,"买金币次数达到:",null,null,"65#1","1"]
[null,2100,21,"0|1","购买体力次数达到",null,null,"购买体力次数达到:",null,null,"65#1","1"]
[null,2200,22,"0|1","锻造炉合成装备件数达到",null,null,"锻造炉合成装备件数达到:",null,null,"65#66","66"]
[null,2300,23,"0|1","每日挑战普通副本次数达到",null,null,"每日挑战普通副本次数达到:",null,null,"65#26","26"]
[null,2400,24,"0|2","每日挑战精英副本次数达到",null,null,"每日挑战精英副本次数达到:",null,null,"65#26","26"]
[null,2500,25,"0|3","每日挑战故事关卡次数达到",null,null,"每日挑战故事关卡次数达到:",null,null,"65#26","26"]
[null,2600,26,"0|4","任意神将完成升级次数达到",null,null,"任意神将完成升级次数达到:",null,null,"65#1","1"]
[null,2700,27,"0|5","收取秘境奖励次数达到",null,null,"收取秘境奖励次数达到:",null,null,"65#7","7"]
[null,2800,28,"0|6","竞技场胜利胜利场次达到",null,null,"竞技场胜利胜利场次达到:",null,null,"65#8","8"]
[null,2900,29,"0|3","完成每日任务数量达到",null,null,"完成每日任务数量达到:",null,null,"65#12","12"]
[null,3000,30,"1#5|1","大地守护戒灵天赋品阶达到：绿+3",null,null,"%s天赋品阶达到：",null,null,"65#50","50"]
[null,3100,31,"0|20","试炼层数达到",null,null,"试炼层数达到：",null,null,"65#30","30"]
[null,3200,32,"0|1","参与试炼副本次数：%s",null,null,"参与试炼副本次数：",null,null,"65#30","30"]
[null,3300,33,"0|10","阵营征募次数达到：%s","4#1000",null,"阵营征募次数达到：",null,null,"65#33","33"]
[null,3400,34,"0|5","累计挑战精英副本次数达到：%s","4#1000",null,"累计挑战精英副本次数达到：（不论成败）",null,null,"65#26","26"]
[null,3500,35,"0|10","累计挑战外敌入侵次数达到：%s","4#1000",null,"累计挑战外敌入侵次数达到：（不论成败）",null,null,"65#26","26"]
[null,3600,36,"0|5","累计秘境极速探索次数达到：%s","4#1000",null,"累计秘境快速探索次数达到：",null,null,"65#26","26"]
[null,3700,37,"0|1000","竞技场排名进入排行榜前：%s","4#1000",null,"竞技场排名进入排行榜前：",null,null,"65#8","8"]
[null,3800,38,"0|300","七日狂欢积分累计达到：%s","4#1000",null,"七日狂欢积分累计达到：",null,null,"65#36","36"]
[null,3900,39,"0|1","神将突破次数达到：%s","4#1000",{"$nulls":4},"65#1","1"]
[null,4000,40,"0|1","领取章节奖励次数达到：%s","4#1000",{"$nulls":4},"65#19","19"]
[null,4100,41,"0|1","神将进阶次数达到：%s","4#1000",{"$nulls":4},"65#1","1"]
[null,4200,42,"0|1","特权等级达到|：%s","4#1000",{"$nulls":4},"65#36","36"]
[null,4300,43,"0|1","领取在线奖励次数达到：%s","4#1000",{"$nulls":4},"65#16","16"]
[null,4400,44,"0|1","领取七日登录奖励次数达到：%s","4#1000",{"$nulls":4},"65#15","15"]
[null,4500,45,"0|1","领取日常任务宝箱奖励次数达到：%s","4#1000",{"$nulls":4},"65#28","28"]
[null,4600,46,"0|1","神将穿戴装备件数达到：%s","4#1000",{"$nulls":4},"65#1","1"]
[null,4700,47,"4|1","碎片合成%s星神将次数达到：%s","4#1000",{"$nulls":4},"65#20","20"]
[null,4800,48,"0|100","消耗体力数量达到：%s","4#1000",{"$nulls":4},"65#26","26"]
[null,4900,49,"0|10","收集不同神将数目达到：%s",{"$nulls":5},"65#1","1"]
[null,5000,50,"10024|1","将神将%s进阶次数达到：%s",null,null,"将神将10024进阶1次",null,null,"65#1","1"]
[null,5100,51,"0|3","上阵%s个神将",{"$nulls":5},"65#2","2"]
[null,5200,52,"17|1","%s（商店id）购买次数：%s",{"$nulls":5},"65#20","20"]
[null,5300,53,"0|5","拥有好友的个数：%s",{"$nulls":5},"65#25","25"]
{"$rows_left_out":48}
{"sheet":"任务数值表","index":3,"n_rows":79,"n_cols":13,"rows_kept":79}
[null,"Id","TaskType","TaskValue",null,"Desc","Reward","Jump"]
[null,"int","int","mut,int|int,2",null,"string","mut,int#int,2","mut,int#int,1"]
[null,2,2,2,null,3,2,2]
[null,"任务id","任务类型","任务参数",null,"任务描述","任务奖励\n物品id#数量","跳转"]
["默认值"]
["正确性校对"]
["校对值"]
[null,10103,1,"0#50",{"$f":"SUBSTITUTE(D8,\"#\",\"|\",1)","v":"0|50"},"群英征募的次数：%s","4#1000",1001,{"$f":"VLOOKUP(C8,任务类型表!$C:$H,6,FALSE)","v":"神将召唤次数达到："},null,{"$f":"IFERROR(SUBSTITUTE(I8,\"%s\",LEFT(D8,FIND(\"#\",D8,1)-1),1),\"\")","v":"神将召唤次数达到："},{"$f":"RIGHT(D8,LEN(D8)-FIND(\"#\",D8,1))","v":"50"},{"$f":"K8&L8","v":"神将召唤次数达到：50"}]
[null,10106,1,"0#150",{"$f":"SUBSTITUTE(D9,\"#\",\"|\",1)","v":"0|150"},"群英征募的次数：%s","4#1001",1001,{"$f":"VLOOKUP(C9,任务类型表!$C:$H,6,FALSE)","v":"神将召唤次数达到："},null,{"$f":"IFERROR(SUBSTITUTE(I9,\"%s\",LEFT(D9,FIND(\"#\",D9,1)-1),1),\"\")","v":"神将召唤次数达到："},{"$f":"RIGHT(D9,LEN(D9)-FIND(\"#\",D9,1))","v":"150"},{"$f":"K9&L9","v":"神将召唤次数达到：150"}]
[null,10111,1,"0#50","0|50","群英征募的次数：%s","4#1002",1001,{"$f":"VLOOKUP(C10,任务类型表!$C:$H,6,FALSE)","v":"神将召唤次数达到："},null,"神将召唤次数达到：","50","神将召唤次数达到：50"]
[null,10114,1,"0#150","0|150","群英征募的次数：%s","4#1003",1001,{"$f":"VLOOKUP(C11,任务类型表!$C:$H,6,FALSE)","v":"神将召唤次数达到："},null,"神将召唤次数达到：","150","神将召唤次数达到：150"]
[null,10204,2,"5#5","5|5","获得%s品质妖灵师数量：%s","4#1004",1001,"获得%s品质妖灵师数量达到：",null,{"$f":"IFERROR(SUBSTITUTE(I12,\"%s\",IF(--LEFT(D12,FIND(\"#\",D12,1)-1)=5,\"SSR\",IF(--LEFT(D12,FIND(\"#\",D12,1)-1)=4,\"SR\",\"R\")),1),\"\")","v":"获得SSR品质妖灵师数量达到："},"5","获得SSR品质妖灵师数量达到：5"]
[null,10211,2,"5#5","5|5","获得%s品质妖灵师数量：%s","4#1005",1001,"获得%s品质妖灵师数量达到：",null,{"$f":"IFERROR(SUBSTITUTE(I13,\"%s\",IF(--LEFT(D13,FIND(\"#\",D13,1)-1)=5,\"SSR\",IF(--LEFT(D13,FIND(\"#\",D13,1)-1)=4,\"SR\",\"R\")),1),\"\")","v":"获得SSR品质妖灵师数量达到："},"5","获得SSR品质妖灵师数量达到：5"]
[null,10301,3,"15#1","15|1","妖灵师等级达到%s的数量：%s","4#1006",22001,{"$f":"VLOOKUP(C14,任务类型表!$C:$H,6,FALSE)","v":"神将等级达到%s级的数量为："},null,"神将等级达到15级的数量为：","1","神将等级达到15级的数量为：1"]
[null,10309,3,"30#1","30|1","妖灵师等级达到%s的数量：%s","4#1007",22001,{"$f":"VLOOKUP(C15,任务类型表!$C:$H,6,FALSE)","v":"神将等级达到%s级的数量为："},null,"神将等级达到30级的数量为：","1","神将等级达到30级的数量为：1"]
[null,10302,3,"40#5","40|5","妖灵师等级达到%s的数量：%s","4#1008",22001,{"$f":"VLOOKUP(C16,任务类型表!$C:$H,6,FALSE)","v":"神将等级达到%s级的数量为："},null,"神将等级达到40级的数量为：","5","神将等级达到40级的数量为：5"]
[null,10303,3,"60#5","60|5","妖灵师等级达到%s的数量：%s","4#1009",22001,{"$f":"VLOOKUP(C17,任务类型表!$C:$H,6,FALSE)","v":"神将等级达到%s级的数量为："},null,"神将等级达到60级的数量为：","5","神将等级达到60级的数量为：5"]
[null,10305,3,"80#5","80|5","妖灵师等级达到%s的数量：%s","4#1010",22001,{"$f":"VLOOKUP(C18,任务类型表!$C:$H,6,FALSE)","v":"神将等级达到%s级的数量为："},null,"神将等级达到80级的数量为：","5","神将等级达到80级的数量为：5"]
[null,10307,3,"100#10","100|10","妖灵师等级达到%s的数量：%s","4#1011",22001,{"$f":"VLOOKUP(C19,任务类型表!$C:$H,6,FALSE)","v":"神将等级达到%s级的数量为："},null,"神将等级达到100级的数量为：","10","神将等级达到100级的数量为：10"]
[null,10309,3,"40#5","40|5","妖灵师等级达到%s的数量：%s","4#1012",22001,{"$f":"VLOOKUP(C20,任务类型表!$C:$H,6,FALSE)","v":"神将等级达到%s级的数量为："},null,{"$f":"IFERROR(SUBSTITUTE(I20,\"%s\",LEFT(D20,FIND(\"#\",D20,1)-1),1),\"\")","v":"神将等级达到40级的数量为："},"5","神将等级达到40级的数量为：5"]
[null,10310,3,"60#5","60|5","妖灵师等级达到%s的数量：%s","4#1013",22001,{"$f":"VLOOKUP(C21,任务类型表!$C:$H,6,FALSE)","v":"神将等级达到%s级的数量为："},null,"神将等级达到60级的数量为：",{"$f":"RIGHT(D21,LEN(D21)-FIND(\"#\",D21,1))","v":"5"},"神将等级达到60级的数量为：5"]
[null,10312,3,"80#5","80|5","妖灵师等级达到%s的数量：%s","4#1014",22001,{"$f":"VLOOKUP(C22,任务类型表!$C:$H,6,FALSE)","v":"神将等级达到%s级的数量为："},null,"神将等级达到80级的数量为：","5","神将等级达到80级的数量为：5"]
[null,10315,3,"100#10","100|10","妖灵师等级达到%s的数量：%s","4#1015",22001,{"$f":"VLOOKUP(C23,任务类型表!$C:$H,6,FALSE)","v":"神将等级达到%s级的数量为："},null,"神将等级达到100级的数量为：","10","神将等级达到100级的数量为：10"]
[null,10404,4,"0#1","0|1","激活异妖的数量：%s","4#1016",3001,{"$f":"VLOOKUP(C24,任务类型表!$C:$H,6,FALSE)","v":"激活异妖数量达到："},null,"激活异妖数量达到：","1","激活异妖数量达到：1"]
[null,10407,4,"0#5","0|5","激活异妖数量：%s","4#1017",3001,{"$f":"VLOOKUP(C25,任务类型表!$C:$H,6,FALSE)","v":"激活异妖数量达到："},null,"激活异妖数量达到：","5","激活异妖数量达到：5"]
[null,10411,4,"0#1","0|1","激活异妖的数量：%s","4#1000",3001,{"$f":"VLOOKUP(C26,任务类型表!$C:$H,6,FALSE)","v":"激活异妖数量达到："},null,"激活异妖数量达到：","1","激活异妖数量达到：1"]
[null,10414,4,"0#5","0|5","激活异妖数量：%s","4#1001",3001,{"$f":"VLOOKUP(C27,任务类型表!$C:$H,6,FALSE)","v":"激活异妖数量达到："},null,"激活异妖数量达到：","5","激活异妖数量达到：5"]
[null,10606,6,"0#80000","0|80000","异妖总战力达到：%s","4#1002",3001,{"$f":"VLOOKUP(C28,任务类型表!$C:$H,6,FALSE)","v":"异妖总战力达到："},null,"异妖总战力达到：","80000","异妖总战力达到：80000"]
[null,10608,6,"0#150000","0|150000","异妖总战力达到：%s","4#1003",3001,{"$f":"VLOOKUP(C29,任务类型表!$C:$H,6,FALSE)","v":"异妖总战力达到："},null,"异妖总战力达到：","150000","异妖总战力达到：150000"]
[null,10613,6,"0#80000","0|80000","异妖总战力达到：%s","4#1004",3001,{"$f":"VLOOKUP(C30,任务类型表!$C:$H,6,FALSE)","v":"异妖总战力达到："},null,"异妖总战力达到：","80000","异妖总战力达到：80000"]
[null,10703,7,"0#20","0|20","竞技场挑战场数：%s","4#1005",8001,{"$f":"VLOOKUP(C31,任务类型表!$C:$H,6,FALSE)","v":"竞技场挑战场次达到："},null,"竞技场挑战场次达到：","20","竞技场挑战场次达到：20"]
[null,10710,7,"0#20","0|20","竞技场挑战场数：%s","4#1006",8001,{"$f":"VLOOKUP(C32,任务类型表!$C:$H,6,FALSE)","v":"竞技场挑战场次达到："},null,"竞技场挑战场次达到：","20","竞技场挑战场次达到：20"]
[null,10805,8,"0#1500","0|1500","竞技场目标积分：%s","4#1007",8001,{"$f":"VLOOKUP(C33,任务类型表!$C:$H,6,FALSE)","v":"竞技场目标积分达到："},null,"竞技场目标积分达到：","1500","竞技场目标积分达到：1500"]
[null,10808,8,"0#3000","0|3000","竞技场目标积分：%s","4#1008",8001,{"$f":"VLOOKUP(C34,任务类型表!$C:$H,6,FALSE)","v":"竞技场目标积分达到："},null,"竞技场目标积分达到：","3000","竞技场目标积分达到：3000"]
[null,10813,8,"0#1500","0|1500","竞技场目标积分：%s","4#1009",8001,{"$f":"VLOOKUP(C35,任务类型表!$C:$H,6,FALSE)","v":"竞技场目标积分达到："},null,"竞技场目标积分达到：","1500","竞技场目标积分达到：1500"]
[null,10815,8,"0#3000","0|3000","竞技场目标积分：%s","4#1010",8001,{"$f":"VLOOKUP(C36,任务类型表!$C:$H,6,FALSE)","v":"竞技场目标积分达到："},null,"竞技场目标积分达到：","3000","竞技场目标积分达到：3000"]
[null,10905,9,"0#90","0|90","玩家等级达到：%s","4#1011",2001,{"$f":"VLOOKUP(C37,任务类型表!$C:$H,6,FALSE)","v":"玩家等级达到："},null,"玩家等级达到：","90","玩家等级达到：90"]
[null,10913,9,"0#90","0|90","玩家等级达到：%s","4#1012",2001,{"$f":"VLOOKUP(C38,任务类型表!$C:$H,6,FALSE)","v":"玩家等级达到："},null,"玩家等级达到：","90","玩家等级达到：90"]
[null,11001,10,"0#10000","0|10000","玩家战力达到：%s","4#1013",2001,{"$f":"VLOOKUP(C39,任务类型表!$C:$H,6,FALSE)","v":"玩家战力达到："},null,"玩家战力达到：","10000","玩家战力达到：10000"]
[null,11002,10,"0#30000","0|30000","玩家战力达到：%s","4#1014",2001,{"$f":"VLOOKUP(C40,任务类型表!$C:$H,6,FALSE)","v":"玩家战力达到："},null,"玩家战力达到：","30000","玩家战力达到：30000"]
[null,11004,10,"0#100000",{"$f":"SUBSTITUTE(D41,\"#\",\"|\",1)","v":"0|100000"},"玩家战力达到：%s","4#1015",2001,{"$f":"VLOOKUP(C41,任务类型表!$C:$H,6,FALSE)","v":"玩家战力达到："},null,"玩家战力达到：","100000",{"$f":"K41&L41","v":"玩家战力达到：100000"}]
[null,11007,10,"0#200000","0|200000","玩家战力达到：%s","4#1016",2001,{"$f":"VLOOKUP(C42,任务类型表!$C:$H,6,FALSE)","v":"玩家战力达到："},null,"玩家战力达到：",{"$f":"RIGHT(D42,LEN(D42)-FIND(\"#\",D42,1))","v":"200000"},"玩家战力达到：200000"]
[null,11009,10,"0#10000","0|10000","玩家战力达到：%s","4#1017",2001,{"$f":"VLOOKUP(C43,任务类型表!$C:$H,6,FALSE)","v":"玩家战力达到："},null,"玩家战力达到：","10000","玩家战力达到：10000"]
[null,11010,10,"0#30000","0|30000","玩家战力达到：%s","4#1017",2001,{"$f":"VLOOKUP(C44,任务类型表!$C:$H,6,FALSE)","v":"玩家战力达到："},null,"玩家战力达到：","30000","玩家战力达到：30000"]
[null,11012,10,"0#100000","0|100000","玩家战力达到：%s","4#1000",2001,{"$f":"VLOOKUP(C45,任务类型表!$C:$H,6,FALSE)","v":"玩家战力达到："},null,"玩家战力达到：","100000","玩家战力达到：100000"]
[null,11015,10,"0#200000","0|200000","玩家战力达到：%s","4#1001",2001,{"$f":"VLOOKUP(C46,任务类型表!$C:$H,6,FALSE)","v":"玩家战力达到："},null,"玩家战力达到：","200000","玩家战力达到：200000"]
[null,11204,12,"0#5","0|5","炼造等级达到：%s","4#1002",5001,{"$f":"VLOOKUP(C47,任务类型表!$C:$H,6,FALSE)","v":"锻造炉等级达到："},null,"锻造炉等级达到：","5","锻造炉等级达到：5"]
[null,11207,12,"0#15","0|15","炼造等级达到：%s","4#1003",5001,{"$f":"VLOOKUP(C48,任务类型表!$C:$H,6,FALSE)","v":"锻造炉等级达到："},null,"锻造炉等级达到：","15","锻造炉等级达到：15"]
[null,11212,12,"0#5","0|5","炼造等级达到：%s","4#1004",5001,{"$f":"VLOOKUP(C49,任务类型表!$C:$H,6,FALSE)","v":"锻造炉等级达到："},null,"锻造炉等级达到：","5","锻造炉等级达到：5"]
[null,11214,12,"0#15","0|15","炼造等级达到：%s","4#1005",5001,{"$f":"VLOOKUP(C50,任务类型表!$C:$H,6,FALSE)","v":"锻造炉等级达到："},null,"锻造炉等级达到：","15","锻造炉等级达到：15"]
[null,11302,13,"2#15","2|15","获取%s品质装备数量：%s","4#1006",18001,{"$f":"VLOOKUP(C51,任务类型表!$C:$H,6,FALSE)","v":"获得%s品质装备数量达到："},{"$f":"--LEFT(D51,1)","v":2},{"$f":"IFERROR(SUBSTITUTE(I51,\"%s\",IF(J51=5,\"橙色\",IF(J51=4,\"紫色\",IF(J51=3,\"蓝色\",\"绿色\"))),1),\"\")","v":"获得绿色品质装备数量达到："},"15","获得绿色品质装备数量达到：15"]
[null,11305,13,"3#12","3|12","获取%s品质装备数量：%s","4#1007",18001,{"$f":"VLOOKUP(C52,任务类型表!$C:$H,6,FALSE)","v":"获得%s品质装备数量达到："},{"$f":"--LEFT(D52,1)","v":3},{"$f":"IFERROR(SUBSTITUTE(I52,\"%s\",IF(J52=5,\"橙色\",IF(J52=4,\"紫色\",IF(J52=3,\"蓝色\",\"绿色\"))),1),\"\")","v":"获得蓝色品质装备数量达到："},"12","获得蓝色品质装备数量达到：12"]
[null,11306,13,"4#8","4|8","获取%s品质装备数量：%s","4#1008",18001,{"$f":"VLOOKUP(C53,任务类型表!$C:$H,6,FALSE)","v":"获得%s品质装备数量达到："},4,"获得紫色品质装备数量达到：","8","获得紫色品质装备数量达到：8"]
[null,11307,13,"5#5","5|5","获取%s品质装备数量：%s","4#1009",18001,{"$f":"VLOOKUP(C54,任务类型表!$C:$H,6,FALSE)","v":"获得%s品质装备数量达到："},5,"获得橙色品质装备数量达到：","5","获得橙色品质装备数量达到：5"]
[null,11309,13,"2#15","2|15","获取%s品质装备数量：%s","4#1010",18001,{"$f":"VLOOKUP(C55,任务类型表!$C:$H,6,FALSE)","v":"获得%s品质装备数量达到："},2,"获得绿色品质装备数量达到：","15","获得绿色品质装备数量达到：15"]
[null,11312,13,"3#12","3|12","获取%s品质装备数量：%s","4#1011",18001,{"$f":"VLOOKUP(C56,任务类型表!$C:$H,6,FALSE)","v":"获得%s品质装备数量达到："},3,"获得蓝色品质装备数量达到：","12","获得蓝色品质装备数量达到：12"]
[null,11313,13,"4#8","4|8","获取%s品质装备数量：%s","4#1012",18001,{"$f":"VLOOKUP(C57,任务类型表!$C:$H,6,FALSE)","v":"获得%s品质装备数量达到："},4,"获得紫色品质装备数量达到：","8","获得紫色品质装备数量达到：8"]
[null,11314,13,"5#5","5|5","获取%s品质装备数量：%s","4#1013",18001,{"$f":"VLOOKUP(C58,任务类型表!$C:$H,6,FALSE)","v":"获得%s品质装备数量达到："},5,"获得橙色品质装备数量达到：","5","获得橙色品质装备数量达到：5"]
[null,11401,14,"102#1","102|1","通关普通副本：%s","4#1014",17001,{"$f":"VLOOKUP(C59,任务类型表!$C:$H,6,FALSE)","v":"通关故事关卡："},{"$f":"--LEFT(D59,3)","v":102},{"$f":"IFERROR(SUBSTITUTE(I59,\"%s\",LEFT(D59,FIND(\"#\",D59,1)-1),1),\"\")","v":"通关故事关卡："},{"$f":"VLOOKUP(J59,[1]ChallengeConfig!$B:$C,2,FALSE)","v":"三途津"},"通关故事关卡：三途津"]
[null,11406,14,"115#1","115|1","通关普通副本：%s","4#1015",17001,{"$f":"VLOOKUP(C60,任务类型表!$C:$H,6,FALSE)","v":"通关故事关卡："},{"$f":"--LEFT(D60,3)","v":115},"通关故事关卡：",{"$f":"VLOOKUP(J60,[1]ChallengeConfig!$B:$C,2,FALSE)","v":"大业"},{"$f":"K60&L60","v":"通关故事关卡：大业"}]
{"$rows_left_out":19}