{"text_format":"3","workbook":"xlsx","n_sheets":3,"sheets":["ChallengeConfig","Sheet1","Sheet2"],"not_rendered":{"comments":1},"read":"whole","date_system":"1900"}

{"sheet":"ChallengeConfig","index":0,"n_rows":70,"n_cols":22,"rows_kept":70}
[null,"Id","Name","RecommendFightAbility","MapId","CoreItem","Type","DifficultType","OpenRule","Time","ItemShow","MapTime","ReviveTime","MostTime","ChapterEventBg","Deaths","IsExplore","SweepingOpenRule","SweepingStoreProbability","SweepingStoreId","SweepingMonsterProbability","SweepingMonsterId"]
[null,"int","string","int","int","mut,int#int,1","int","int","mut,int#int,2","int","mut,int#int,1","int","mut,int#int,1","int","string","int","int","mut,int#int,1","mut,int#int,2","int","mut,int#int,2","int"]
[null,2,3,3,2,3,2,2,2,2,3,2,2,2,3,2,2,2,4,4,4,4]
[null,"地图id","副本名称","推荐战力","对应副本id","重点道具预览","副本所属类别\n1普通\n2试炼\n3精英\n4传说","地图难度类型\n1简单\n2普通\n3困难\n4地狱","开启条件\n关卡id（副本id）#等级","限定通关时间\n（用于三星判断）","副本掉落预览","副本总时间（秒）","复活时间公式","副本中单场战斗最长时间，超过判负（秒）","剧情背景图","限定死亡次数\n（用于三星判断）","是否有探索度\n1有\n0没有","副本扫荡开启条件\n普通：1#星数\n精英：2#完成功绩数","副本扫荡云游商人出现概率","副本扫荡出现\n云游商人id","副本扫荡精英怪出现概率","副本扫荡出现\n精英怪怪物组"]
["默认值",0," ",0,0,"null",0,0,"null",0,"null",0,"null",0,null,0,0,"1#3","null"]
["正确性校对"]
["校对值"]
[null,100,"序章",100,100,"4#1508",1,1,"0#0",240,"3#19",9999999999,"0#0#0#5",600,"r_duihuabg_001",2,1,"1#3"]
[null,101,"浓雾森林",35000,101,"4#3#14",1,1,"3101#0",120,"4#3#14",1200,"0#0#0#5",90,"r_duihuabg_001",2,1,"1#3"]
[null,102,"三途津",53000,102,"4#3#14",1,1,"4201#0",180,"4#3#14",1200,"0#0#0#5",90,"r_duihuabg_002",2,1,"1#3"]
[null,103,"逃难者",79000,103,"4#3",1,1,"5201#0",180,"4#14#3",1200,"0#0#0#5",90,"r_duihuabg_003",2,1,"1#3"]
[null,104,"藏宝图",92000,104,"12001#4",1,1,"6201#0",240,"4#14#3",1200,"0#0#0#5",90,"r_duihuabg_004",2,1,"1#3"]
[null,105,"孤岛",105000,105,"12001#4",1,1,"7201#0",240,"4#14#3",1200,"0#0#0#5",90,"r_duihuabg_005",2,1,"1#3"]
[null,106,"救援",113000,106,"12001#4",1,1,"8201#0",240,"12001#4#14#3",1200,"0#0#0#5",90,"r_duihuabg_001",2,1,"1#3"]
[null,107,"追回财物",139000,107,"12001#4",1,1,"10201#0",240,"12001#4#14#3",1200,"0#0#0#5",90,"r_duihuabg_002",2,1,"1#3"]
[null,108,"终亡教会",153000,108,"12001#4",1,1,"14201#0",240,"12001#4#14#3",1200,"0#0#0#5",90,"r_duihuabg_003",2,1,"1#3"]
[null,109,"清理道路",166000,109,"12001#12012",1,1,"3102#0",240,"12012#12001#4#14#3",1200,"0#0#0#5",90,"r_duihuabg_004",2,1,"1#3"]
[null,110,"地堡",180000,110,"12001#12012",1,1,"6202#0",240,"12012#12001#4#14#3",1200,"0#0#0#5",90,"r_duihuabg_005",2,1,"1#3"]
[null,111,"准备",192000,111,"12001#12012",1,1,"10202#0",240,"12012#12001#4#14#3",1200,"0#0#0#5",90,"r_duihuabg_001",2,1,"1#3"]
[null,112,"幻境",210000,112,"12001#12012",1,1,"15102#0",240,"12012#12001#4#14#3",1200,"0#0#0#5",90,"r_duihuabg_002",2,1,"1#3"]
[null,113,"承诺",226000,113,"12001#12012",1,1,"3403#0",240,"12012#12001#4#14#3",1200,"0#0#0#5",90,"r_duihuabg_003",2,1,"1#3"]
[null,114,"影子",241000,114,"12001#12012",1,1,"7203#0",240,"12012#12001#4#14#3",1200,"0#0#0#5",90,"r_duihuabg_004",2,1,"1#3"]
[null,115,"大业",266000,115,"12001#12012",1,1,"10403#0",240,"12012#12001#4#14#3",1200,"0#0#0#5",90,"r_duihuabg_005",2,1,"1#3"]
[null,116,"妖兽疑踪",288000,116,"12001#12012",1,1,"14203#0",240,"12012#12001#4#14#3",1200,"0#0#0#5",90,"r_duihuabg_005",2,1,"1#3"]
[null,117,"风波又起",292000,117,"12001#12012",1,1,"3254#0",240,"12012#12001#4#14#3",1200,"0#0#0#5",90,"r_duihuabg_005",2,1,"1#3"]
[null,118,"又见木羊",336000,118,"12001#12012",1,1,"7154#0",240,"12012#12001#4#14#3",1200,"0#0#0#5",90,"r_duihuabg_005",2,1,"1#3"]
[null,119,"危机将至",393000,119,"12001#12012",1,1,"12254#0",240,"12012#12001#4#14#3",1200,"0#0#0#5",90,"r_duihuabg_005",2,1,"1#3"]
[null,120,"神秘组织",506000,120,"12001#12012",1,1,"1055#0",240,"12012#12001#4#14#3",1200,"0#0#0#5",90,"r_duihuabg_005",2,1,"1#3"]
[null,201,"英雄副本1",20000,201,"19#1508#4",2,1,"0#15",240,"19#4#3201#3202#3203#3204#3205#3206#3207#3208#3209#3210#3211#3212#3213#3214#3215#3216#3217#3218",1200,"0#0#0#5",90,null,4,1]
[null,202,"英雄副本2",26850,202,"19#1508#4",2,1,"0#20",240,"19#4#3201#3202#3203#3204#3205#3206#3207#3208#3209#3210#3211#3212#3213#3214#3215#3216#3217#3218",1200,"0#0#0#5",90,null,4,1]
[null,203,"英雄副本3",33700,203,"19#1508#4",2,1,"0#26",240,"19#4#3201#3202#3203#3204#3205#3206#3207#3208#3209#3210#3211#3212#3213#3214#3215#3216#3217#3218",1200,"0#0#0#5",90,null,4,1]
[null,204,"英雄副本4",40550,204,"19#1509#4",2,1,"0#31",240,"19#4#3201#3202#3203#3204#3205#3206#3207#3208#3209#3210#3211#3212#3213#3214#3215#3216#3217#3218",1200,"0#0#0#5",90,null,4,1]
[null,205,"英雄副本5",70000,205,"19#1509#4",2,1,"0#35",240,"19#4#3201#3202#3203#3204#3205#3206#3207#3208#3209#3210#3211#3212#3213#3214#3215#3216#3217#3218",1200,"0#0#0#5",90,null,4,1]
[null,206,"英雄副本6",76600,206,"19#1509#4",2,1,"0#38",240,"19#4#3201#3202#3203#3204#3205#3206#3207#3208#3209#3210#3211#3212#3213#3214#3215#3216#3217#3218",1200,"0#0#0#5",90,null,4,1]
[null,207,"英雄副本7",91200,207,"19#1510#4",2,1,"0#42",240,"19#4#3201#3202#3203#3204#3205#3206#3207#3208#3209#3210#3211#3212#3213#3214#3215#3216#3217#3218",1200,"0#0#0#5",90,null,4,1]
[null,208,"英雄副本8",106850,208,"19#1510#4",2,1,"0#44",240,"19#4#3201#3202#3203#3204#3205#3206#3207#3208#3209#3210#3211#3212#3213#3214#3215#3216#3217#3218",1200,"0#0#0#5",90,null,4,1]
[null,209,"英雄副本9",132850,209,"19#1510#4",2,1,"0#47",240,"19#4#3201#3202#3203#3204#3205#3206#3207#3208#3209#3210#3211#3212#3213#3214#3215#3216#3217#3218",1200,"0#0#0#5",90,null,4,1]
[null,210,"英雄副本10",152150,210,"19#1510#4",2,1,"0#49",240,"19#4#3201#3202#3203#3204#3205#3206#3207#3208#3209#3210#3211#3212#3213#3214#3215#3216#3217#3218",1200,"0#0#0#5",90,null,4,1]
[null,211,"英雄副本11",177800,211,"19#1511#4",2,1,"0#51",240,"19#4#3201#3202#3203#3204#3205#3206#3207#3208#3209#3210#3211#3212#3213#3214#3215#3216#3217#3218",1200,"0#0#0#5",90,null,4,1]
[null,212,"英雄副本12",119900,212,"19#1511#4",2,1,"0#54",240,"19#4#3201#3202#3203#3204#3205#3206#3207#3208#3209#3210#3211#3212#3213#3214#3215#3216#3217#3218",1200,"0#0#0#5",90,null,4,1]
[null,213,"英雄副本13",116950,213,"19#1511#4",2,1,"0#55",240,"19#4#3201#3202#3203#3204#3205#3206#3207#3208#3209#3210#3211#3212#3213#3214#3215#3216#3217#3218",1200,"0#0#0#5",90,null,4,1]
[null,214,"英雄副本14",114000,214,"19#1511#4",2,1,"0#57",240,"19#4#3201#3202#3203#3204#3205#3206#3207#3208#3209#3210#3211#3212#3213#3214#3215#3216#3217#3218",1200,"0#0#0#5",90,null,4,1]
[null,215,"英雄副本15",168950,215,"19#1511#4",2,1,"0#59",240,"19#4#3201#3202#3203#3204#3205#3206#3207#3208#3209#3210#3211#3212#3213#3214#3215#3216#3217#3218",1200,"0#0#0#5",90,null,4,1]
[null,2000,"试炼副本奖励层",null,2000,null,2,1,"0#0",240,"1509#12012#12001#4#14#3",999999999,"0#0#0#5",90,null,4,0]
[null,2001,"试炼副本",null,2001,null,2,1,"0#0",240,"1509#12012#12001#4#14#3",999999999,"0#0#0#5",90,null,4,0]
[null,2002,"试炼副本",null,2002,null,2,1,"0#0",240,"1509#12012#12001#4#14#3",999999999,"0#0#0#5",90,null,4,0]
[null,2003,"试炼副本",null,2003,null,2,1,"0#0",240,"1509#12012#12001#4#14#3",999999999,"0#0#0#5",90,null,4,0]
[null,3011,"古寺疑云",182800,301,"1515#25",3,1,"12201#0",240,"19#4#3201#3202#3203#3204#3205#3206#3207#3208#3209#3210#3211#3212#3213#3214#3215#3216#3217#3218",1800,"0#0#0#5",90,null,4,0,"2#7","1#100|0#700",3,"1#100|0#1300",30101]
[null,3012,"古寺疑云",185600,301,"1515#25",3,2,"12201#0",240,"19#4#3201#3202#3203#3204#3205#3206#3207#3208#3209#3210#3211#3212#3213#3214#3215#3216#3217#3218",1800,"0#0#0#5",90,null,4,0,"2#13","1#100|0#700",3,"1#100|0#1300",30102]
[null,3013,"古寺疑云",187400,301,"1515#25",3,3,"12201#0",240,"19#4#3201#3202#3203#3204#3205#3206#3207#3208#3209#3210#3211#3212#3213#3214#3215#3216#3217#3218",1800,"0#0#0#5",90,null,4,0,"2#18","1#100|0#700",3,"1#100|0#1300",30103]
[null,3014,"古寺疑云",189200,301,"1515#25",3,4,"12201#0",240,"19#4#3201#3202#3203#3204#3205#3206#3207#3208#3209#3210#3211#3212#3213#3214#3215#3216#3217#3218",1800,"0#0#0#5",90,null,4,0,"2#23","1#100|0#700",3,"1#100|0#1300",30104]
[null,3021,"古墓寻踪",191000,{"$f":"E48+1","v":302},"1515#1516#25",{"$f":"G48","v":3},1,"14201#0",{"$f":"J48","v":240},{"$f":"K51","v":"19#4#3201#3202#3203#3204#3205#3206#3207#3208#3209#3210#3211#3212#3213#3214#3215#3216#3217#3218"},1800,{"$f":"M51","v":"0#0#0#5"},90,{"$f":"O51","v":0},{"$f":"P51","v":4},{"$f":"Q51","v":0},"2#6","1#100|0#700",3,"1#100|0#1300",30201]
[null,3022,"古墓寻踪",196000,302,"1515#1516#25",3,2,"14201#0",240,"19#4#3201#3202#3203#3204#3205#3206#3207#3208#3209#3210#3211#3212#3213#3214#3215#3216#3217#3218",1800,"0#0#0#5",90,0,4,0,"2#11","1#100|0#700",3,"1#100|0#1300",30202]
[null,3023,"古墓寻踪",200800,302,"1515#1516#25",3,3,"14201#0",240,"19#4#3201#3202#3203#3204#3205#3206#3207#3208#3209#3210#3211#3212#3213#3214#3215#3216#3217#3218",1800,"0#0#0#5",90,0,4,0,"2#15","1#100|0#700",3,"1#100|0#1300",30203]
[null,3024,"古墓寻踪",205700,302,"1515#1516#25",3,4,"14201#0",240,"19#4#3201#3202#3203#3204#3205#3206#3207#3208#3209#3210#3211#3212#3213#3214#3215#3216#3217#3218",1800,"0#0#0#5",90,0,4,0,"2#20","1#100|0#700",3,"1#100|0#1300",30204]
[null,3031,"诡影废墟",210200,303,"1515#1516#25",3,1,"2302#0",240,"19#4#3201#3202#3203#3204#3205#3206#3207#3208#3209#3210#3211#3212#3213#3214#3215#3216#3217#3218",1800,"0#0#0#5",90,0,4,0,"2#6","1#100|0#700",9,"1#100|0#1300",30301]
[null,3032,"诡影废墟",228400,303,"1515#1516#25",3,2,"2302#0",240,"19#4#3201#3202#3203#3204#3205#3206#3207#3208#3209#3210#3211#3212#3213#3214#3215#3216#3217#3218",1800,"0#0#0#5",90,0,4,0,"2#11","1#100|0#700",9,"1#100|0#1300",30302]
[null,3033,"诡影废墟",242100,303,"1515#1516#25",3,3,"2302#0",240,"19#4#3201#3202#3203#3204#3205#3206#3207#3208#3209#3210#3211#3212#3213#3214#3215#3216#3217#3218",1800,"0#0#0#5",90,0,4,0,"2#17","1#100|0#700",9,"1#100|0#1300",30303]
[null,3034,"诡影废墟",253400,303,"1515#1516#25",3,4,"2302#0",240,"19#4#3201#3202#3203#3204#3205#3206#3207#3208#3209#3210#3211#3212#3213#3214#3215#3216#3217#3218",1800,"0#0#0#5",90,0,4,0,"2#23","1#100|0#700",9,"1#100|0#1300",30304]
[null,3041,"五灵阵法",258300,304,"1515#1516#25",3,1,"6202#0",240,"19#4#3201#3202#3203#3204#3205#3206#3207#3208#3209#3210#3211#3212#3213#3214#3215#3216#3217#3218",1800,"0#0#0#5",90,0,4,0,"2#4","1#100|0#700",9,"1#100|0#1300",30401]
[null,3042,{"$f":"C60","v":"五灵阵法"},271300,304,"1515#1516#25",3,2,"6202#0",240,"19#4#3201#3202#3203#3204#3205#3206#3207#3208#3209#3210#3211#3212#3213#3214#3215#3216#3217#3218",1800,"0#0#0#5",90,0,4,0,"2#8","1#100|0#700",9,"1#100|0#1300",30402]
[null,3043,{"$f":"C61","v":"五灵阵法"},292400,304,"1515#1516#25",3,3,"6202#0",240,"19#4#3201#3202#3203#3204#3205#3206#3207#3208#3209#3210#3211#3212#3213#3214#3215#3216#3217#3218",1800,"0#0#0#5",90,0,4,0,"2#13","1#100|0#700",9,"1#100|0#1300",30403]
[null,3044,{"$f":"C62","v":"五灵阵法"},301800,304,"1515#1516#25",3,4,"6202#0",240,"19#4#3201#3202#3203#3204#3205#3206#3207#3208#3209#3210#3211#3212#3213#3214#3215#3216#3217#3218",1800,"0#0#0#5",90,0,4,0,"2#19","1#100|0#700",9,"1#100|0#1300",30404]
[null,3051,"琳琅洞天",323000,305,"1515#1516#1517#25",3,1,"12202#0",240,"19#4#3201#3202#3203#3204#3205#3206#3207#3208#3209#3210#3211#3212#3213#3214#3215#3216#3217#3218",1800,"0#0#0#5",90,0,4,0,"2#4","1#100|0#700",9,"1#100|0#1300",30501]
[null,3052,{"$f":"C64","v":"琳琅洞天"},332100,305,"1515#1516#1517#25",3,2,"12202#0",240,"19#4#3201#3202#3203#3204#3205#3206#3207#3208#3209#3210#3211#3212#3213#3214#3215#3216#3217#3218",1800,"0#0#0#5",90,0,4,0,"2#8","1#100|0#700",9,"1#100|0#1300",30502]
[null,3053,{"$f":"C65","v":"琳琅洞天"},346200,305,"1515#1516#1517#25",3,3,"12202#0",240,"19#4#3201#3202#3203#3204#3205#3206#3207#3208#3209#3210#3211#3212#3213#3214#3215#3216#3217#3218",1800,"0#0#0#5",90,0,4,0,"2#11","1#100|0#700",9,"1#100|0#1300",30503]
[null,3054,{"$f":"C66","v":"琳琅洞天"},353500,305,"1515#1516#1517#25",3,4,"12202#0",240,"19#4#3201#3202#3203#3204#3205#3206#3207#3208#3209#3210#3211#3212#3213#3214#3215#3216#3217#3218",1800,"0#0#0#5",90,0,4,0,"2#13","1#100|0#700",9,"1#100|0#1300",30504]
[null,4001,"无尽副本",100000,401,"1509#12001#12012",4,1,"0#1",240,"19#4#3201#3202#3203#3204#3205#3206#3207#3208#3209#3210#3211#3212#3213#3214#3215#3216#3217#3218",9999999999,"0#0#0#5",90,0,4,0]
[null,4002,"无尽副本",100000,401,"1509#12001#12012",4,1,"0#1",240,"19#4#3201#3202#3203#3204#3205#3206#3207#3208#3209#3210#3211#3212#3213#3214#3215#3216#3217#3218",9999999999,"0#0#0#5",90,0,4,0]
[null,4003,"无尽副本",100000,401,"1509#12001#12012",4,1,"0#1",240,"19#4#3201#3202#3203#3204#3205#3206#3207#3208#3209#3210#3211#3212#3213#3214#3215#3216#3217#3218",9999999999,"0#0#0#5",90,0,4,0]

{"sheet":"Sheet1","index":1,"n_rows":44,"n_cols":8,"rows_kept":44}
[]
[]
[]
["副本",null,"天数",null,"推荐战力"]
["浓雾森林",1,0,null,{"$f":"VLOOKUP(C5,#REF!,27,TRUE)","v":{"$error":"#REF!"}}]
["三途津",2,0.4,null,{"$f":"VLOOKUP(C6,#REF!,27,TRUE)","v":{"$error":"#REF!"}}]
["逃难者",3,0.9,{"$f":"ROUNDUP(C7,0)","v":1},{"$f":"VLOOKUP(D7,#REF!,27,TRUE)","v":{"$error":"#REF!"}},36000]
["藏宝图",4,1.9,{"$f":"ROUNDUP(C8,0)","v":2},{"$f":"VLOOKUP(D8,#REF!,27,TRUE)","v":{"$error":"#REF!"}},50000]
["孤岛",5,2.9,3,{"$f":"VLOOKUP(D9,#REF!,27,TRUE)","v":{"$error":"#REF!"}},64000]
["救援",6,4.9,5,{"$f":"VLOOKUP(D10,#REF!,27,TRUE)","v":{"$error":"#REF!"}},84000]
["追回财物",7,7.9,8,{"$f":"VLOOKUP(D11,#REF!,27,TRUE)","v":{"$error":"#REF!"}},114000]
["终亡教会",8,11.9,12,{"$f":"VLOOKUP(D12,#REF!,27,TRUE)","v":{"$error":"#REF!"}},138000]
["清理道路",9,{"$f":"C12+5","v":16.9},17,{"$f":"VLOOKUP(D13,#REF!,27,TRUE)","v":{"$error":"#REF!"}},172000]
["地堡",10,{"$f":"C13+6","v":22.9},23,{"$f":"VLOOKUP(D14,#REF!,27,TRUE)","v":{"$error":"#REF!"}},222000]
["准备",11,{"$f":"C14+7","v":29.9},30,{"$f":"VLOOKUP(D15,#REF!,27,TRUE)","v":{"$error":"#REF!"}},283000]
["幻境",12,{"$f":"C15+8","v":37.9},38,{"$f":"VLOOKUP(D16,#REF!,27,TRUE)","v":{"$error":"#REF!"}},267000]
["承诺",13,{"$f":"C16+9","v":46.9},47,{"$f":"VLOOKUP(D17,#REF!,27,TRUE)","v":{"$error":"#REF!"}},316000]
["影子",14,{"$f":"C17+10","v":56.9},57,{"$f":"VLOOKUP(D18,#REF!,27,TRUE)","v":{"$error":"#REF!"}},383000]
["大业",15,{"$f":"C18+11","v":67.9},68,{"$f":"VLOOKUP(D19,#REF!,27,TRUE)","v":{"$error":"#REF!"}},440000]
[]
[]
[]
[]
[null,null,0,"19#1|14#8000"]
[null,null,1,"4#150|14#50000|3#2500"]
[null,null,2,"4#150|14#60000|3#3000"]
[null,null,3,"4#150|14#70000|3#3000",{"$nulls":3},"绿色"]
[null,null,4,"4#150|14#80000|3#3000",{"$nulls":3},"绿色"]
[null,null,5,"4#150|14#90000|3#3000",{"$nulls":3},"蓝色"]
[null,null,6,"12001#10|4#150|14#100000|3#3000",{"$nulls":3},"蓝色"]
[null,null,7,"12001#15|4#150|14#100000|3#3000",{"$nulls":3},"紫色"]
[null,null,8,"12001#20|4#150|14#100000|3#3000",{"$nulls":3},"紫色"]
[null,null,9,"12001#20|12012#5|4#150|14#100000|3#3000",{"$nulls":3},"紫色"]
[null,null,10,"12001#20|12012#10|4#150|14#100000|3#3000",{"$nulls":3},"紫色"]
[null,null,11,"12001#20|12012#15|4#150|14#100000|3#3000",{"$nulls":3},"紫色"]
[null,null,12,"12001#25|12012#15|4#150|14#100000|3#3000",{"$nulls":3},"橙色t4"]
[null,null,13,"12001#30|12012#15|4#150|14#100000|3#3000",{"$nulls":3},"橙色t4"]
[null,null,14,"12001#30|12012#20|4#150|14#100000|3#3000",{"$nulls":3},"橙色t4"]
[null,null,15,"12001#30|12012#25|4#150|14#100000|3#3000",{"$nulls":3},"橙色t4"]
[null,null,16,{"$nulls":4},"橙色t4"]
[null,null,17,{"$nulls":4},"橙色t4"]
[null,null,18,{"$nulls":4},"橙色t4"]
[null,null,19,{"$nulls":4},"橙色t4"]
[null,null,20]

{"sheet":"Sheet2","index":2,"n_rows":4,"n_cols":22,"rows_kept":4}
[null,3061,"死亡沼泽",{"$f":"ChallengeConfig!D64*2","v":646000},{"$f":"ChallengeConfig!E64+1","v":306},"1511#1511#25",{"$f":"ChallengeConfig!G64","v":3},{"$f":"ChallengeConfig!H64","v":1},"0#99",{"$f":"ChallengeConfig!J64","v":240},{"$f":"ChallengeConfig!K67","v":"19#4#3201#3202#3203#3204#3205#3206#3207#3208#3209#3210#3211#3212#3213#3214#3215#3216#3217#3218"},{"$f":"ChallengeConfig!L67","v":1800},{"$f":"ChallengeConfig!M67","v":"0#0#0#5"},{"$f":"ChallengeConfig!N67","v":90},{"$f":"ChallengeConfig!O67","v":0},{"$f":"ChallengeConfig!P67","v":4},{"$f":"ChallengeConfig!Q67","v":0},"2#3","1#100|0#900",9,"1#100|0#1300",10102]
[null,3062,"死亡沼泽",{"$f":"ChallengeConfig!D65*2","v":664200},{"$f":"ChallengeConfig!E65+1","v":306},"1511#1511#25",{"$f":"ChallengeConfig!G65","v":3},{"$f":"ChallengeConfig!H65","v":2},"0#99",{"$f":"ChallengeConfig!J65","v":240},{"$f":"K1","v":"19#4#3201#3202#3203#3204#3205#3206#3207#3208#3209#3210#3211#3212#3213#3214#3215#3216#3217#3218"},1800,"0#0#0#5",90,0,4,0,"2#6","1#100|0#900",9,"1#100|0#1300",10102]
[null,3063,"死亡沼泽",{"$f":"ChallengeConfig!D66*2","v":692400},{"$f":"ChallengeConfig!E66+1","v":306},"1511#1511#25",{"$f":"ChallengeConfig!G66","v":3},{"$f":"ChallengeConfig!H66","v":3},"0#99",{"$f":"ChallengeConfig!J66","v":240},"19#4#3201#3202#3203#3204#3205#3206#3207#3208#3209#3210#3211#3212#3213#3214#3215#3216#3217#3218",1800,"0#0#0#5",90,0,4,0,"2#9","1#100|0#900",9,"1#100|0#1300",10102]
[null,3064,"死亡沼泽",{"$f":"ChallengeConfig!D67*2","v":707000},{"$f":"ChallengeConfig!E67+1","v":306},"1511#1511#25",{"$f":"ChallengeConfig!G67","v":3},{"$f":"ChallengeConfig!H67","v":4},"0#99",{"$f":"ChallengeConfig!J67","v":240},"19#4#3201#3202#3203#3204#3205#3206#3207#3208#3209#3210#3211#3212#3213#3214#3215#3216#3217#3218",1800,"0#0#0#5",90,0,4,0,"2#10","1#100|0#900",9,"1#100|0#1300",10102]