{"text_format":"3","workbook":"xlsx","n_sheets":6,"sheets":["PassiveSkillConfig","特性修改","辅助","Sheet2","Sheet1","汇总"],"not_rendered":{"external_links":2,"defined_names":3,"comments":1},"read":"whole","date_system":"1900"}

{"sheet":"PassiveSkillConfig","index":0,"n_rows":2099,"n_cols":11,"rows_kept":2099}
[null,"Id","Name","Type","ShortDesc","Desc","DescValue","DescColor","Icon","NoUse","NoUse"]
[null,"int","string","int","string","string","mut,string#string,1","mut,int#int,1","int","boolean","boolean"]
[null,2,3,3,3,3,3,3,3,0,0]
[null,"技能id","技能名称","技能类型","短描述","技能描述","描述参数","参数颜色","技能图标","校验","校验"]
["默认值",0,{"$f":"\"\"","v":""},3,null,{"$f":"\"\"","v":""}]
["正确性校对"]
["校对值"]
[null,1001,"破锋",null,null,"战斗中，增加10%攻击力。",{"$nulls":3},{"$f":"IF((LEN(F8)-LEN(SUBSTITUTE(F8,\"%\",\"\")))=(LEN(G8)-LEN(SUBSTITUTE(G8,\"#\",\"\")))+1,\"\",FALSE)","v":""},{"$f":"IF((LEN(G8)-LEN(SUBSTITUTE(G8,\"#\",\"\")))=(LEN(H8)-LEN(SUBSTITUTE(H8,\"#\",\"\"))),\"\",FALSE)","v":""}]
[null,1002,"斩神",null,null,"战斗中，增加5%暴击率。",{"$nulls":3},{"$f":"IF((LEN(F9)-LEN(SUBSTITUTE(F9,\"%\",\"\")))=(LEN(G9)-LEN(SUBSTITUTE(G9,\"#\",\"\")))+1,\"\",FALSE)","v":""},{"$f":"IF((LEN(G9)-LEN(SUBSTITUTE(G9,\"#\",\"\")))=(LEN(H9)-LEN(SUBSTITUTE(H9,\"#\",\"\"))),\"\",FALSE)","v":""}]
[null,1003,"斩神",null,null,"战斗中，增加5%暴击率。",{"$nulls":3},"",""]
[null,1004,"破锋",null,null,"战斗中，增加10%攻击力。",{"$nulls":3},"",""]
[null,1005,"圣体",null,null,"战斗中，增加10%最大生命值。",{"$nulls":3},"",""]
[null,1006,"天御",null,null,"战斗中，增加10%伤害减免。",{"$nulls":3},"",""]
[null,1007,"天伤",null,null,"战斗中，增加10%伤害。",{"$nulls":3},"",""]
[null,1008,"破锋",null,null,"战斗中，增加10%攻击力。",{"$nulls":3},"",""]
[null,1009,"斩神",null,null,"战斗中，增加5%暴击率。",{"$nulls":3},"",""]
[null,1010,"迅雷",null,null,"战斗中，增加634点速度。",{"$nulls":3},false,""]
[null,1011,"舍生取义",null,null,"死亡时，立即回复己方全体40%攻击力的血量。",{"$nulls":3},"",""]
[null,1012,"愈合",null,null,"进入战斗后，每1秒回复200生命",{"$nulls":3},false,""]
[null,1013,"天御",null,null,"战斗中，增加20%伤害减免。",{"$nulls":3},"",""]
[null,1014,"精术",null,null,"战斗中，增加10%效果命中。",{"$nulls":3},"",""]
[null,1015,"破空",null,null,"战斗中，增加30%暴击伤害。",{"$nulls":3},"",""]
[null,1016,"迅雷",null,null,"战斗中，增加1056点速度。",{"$nulls":3},false,""]
[null,1017,"精术",null,null,"战斗中，增加10%效果命中。",{"$nulls":3},"",""]
[null,1018,"回春",null,null,"战斗中，增加20%受到的治疗效果。",{"$nulls":3},"",""]
[null,1019,"精术",null,null,"战斗中，增加10%效果命中。",{"$nulls":3},"",""]
[null,1020,"天伤",null,null,"战斗中，增加20%伤害。",{"$nulls":3},"",""]
[null,1021,"破锋",null,null,"战斗中，增加20%攻击力。",{"$nulls":3},"",""]
[null,1022,"迅雷",null,null,"战斗中，增加1056点速度。",{"$nulls":3},false,""]
[null,1023,"愈合",null,null,"进入战斗后，每1秒回复500生命",{"$nulls":3},false,""]
[null,1024,"低语",null,null,"免疫沉默状态。",{"$nulls":3},false,""]
[null,1025,"明神",null,null,"免疫眩晕状态。",{"$nulls":3},false,""]
[null,10001,"针锋相对",null,null,"受到武卫伤害时，回复1000点生命。",{"$nulls":3},false,""]
[null,10002,"针锋相对",null,null,"受到武卫伤害时，回复<color=#529764FF>1200点</color>生命。",{"$nulls":3},false,""]
[null,10003,"针锋相对",null,null,"受到武卫伤害时，回复<color=#529764FF>1400点</color>生命。",{"$nulls":3},false,""]
[null,10004,"针锋相对",null,null,"受到武卫伤害时，回复<color=#529764FF>1600点</color>生命。",{"$nulls":3},false,""]
[null,10005,"针锋相对",null,null,"受到武卫伤害时，回复<color=#529764FF>1800点</color>生命。",{"$nulls":3},false,""]
[null,10006,"针锋相对",null,null,"受到武卫伤害时，回复<color=#529764FF>2000点</color>生命。",{"$nulls":3},false,""]
[null,10007,"针锋相对",null,null,"受到武卫伤害时，回复<color=#529764FF>2200点</color>生命。",{"$nulls":3},false,""]
[null,10008,"针锋相对",null,null,"受到武卫伤害时，回复<color=#529764FF>2500点</color>生命。",{"$nulls":3},false,""]
{"$rows_left_out":2060}
{"sheet":"特性修改","index":1,"n_rows":110,"n_cols":12,"rows_kept":110}
[null,"名称",null,"修改"]
[500101,"愈合","进入战斗后，每5秒回复8000生命。","进入战斗后，每5秒回复5000生命。",{"$nulls":7},{"$f":"IF(ISBLANK(D2),C2,D2)","v":"进入战斗后，每5秒回复5000生命。"}]
[500102,"针锋相对","被武卫造成伤害时，回复2500生命。",{"$nulls":8},{"$f":"IF(ISBLANK(D3),C3,D3)","v":"被武卫造成伤害时，回复2500生命。"}]
[500103,"针锋相对","被天罚造成伤害时，回复2500生命。",{"$nulls":8},"被天罚造成伤害时，回复2500生命。"]
[500104,"针锋相对","被秘法造成伤害时，回复2500生命。",{"$nulls":8},"被秘法造成伤害时，回复2500生命。"]
[500105,"针锋相对","被玄策造成伤害时，回复2500生命。",{"$nulls":8},"被玄策造成伤害时，回复2500生命。"]
[500106,"针锋相对","被生花造成伤害时，回复2500生命。",{"$nulls":8},"被生花造成伤害时，回复2500生命。"]
[500201,"战甲","发动技能时，60%的概率将护甲的50%视作额外攻击力。","发动技能时，20%的概率将护甲的50%视作额外攻击力。",{"$nulls":7},"发动技能时，20%的概率将护甲的50%视作额外攻击力。"]
[500202,"御甲","受到物理伤害时，60%的概率将攻击的50%视作额外护甲。","受到物理伤害时，20%的概率将攻击的50%视作额外护甲。",{"$nulls":7},"受到物理伤害时，20%的概率将攻击的50%视作额外护甲。"]
[500203,"狂甲","受到物理伤害后，60%的概率将护甲的50%视作额外攻击力，持续10秒。",{"$nulls":8},"受到物理伤害后，60%的概率将护甲的50%视作额外攻击力，持续10秒。"]
[500204,"御魔","受到魔法伤害时，60%的概率将攻击的50%视作额外魔抗。","受到魔法伤害时，20%的概率将攻击的50%视作额外魔抗。",{"$nulls":7},"受到魔法伤害时，20%的概率将攻击的50%视作额外魔抗。"]
[500205,"魔攻","受到魔法伤害后，60%的概率将魔抗的50%视作额外攻击力，持续10秒。",{"$nulls":8},"受到魔法伤害后，60%的概率将魔抗的50%视作额外攻击力，持续10秒。"]
[500206,"背水一战","发动技能后，60%的概率将护甲的50%视作额外攻击力，持续10秒。","发动技能后，10%的概率将护甲的50%视作额外攻击力，持续10秒。",{"$nulls":7},"发动技能后，10%的概率将护甲的50%视作额外攻击力，持续10秒。"]
[500207,"破釜沉舟","发动技能后，60%的概率将魔抗的50%视作额外攻击力，持续10秒。","发动技能后，10%的概率将魔抗的50%视作额外攻击力，持续10秒。",{"$nulls":7},"发动技能后，10%的概率将魔抗的50%视作额外攻击力，持续10秒。"]
[500301,"乘胜追击","持续伤害效果命中后，增加自身10%攻击力，持续20秒。","持续伤害效果命中后，增加自身10%攻击力，持续8秒。",{"$nulls":7},"持续伤害效果命中后，增加自身10%攻击力，持续8秒。"]
[500302,"骤雨","进入战斗20秒后，增加自身50%攻击力，持续30秒。",{"$nulls":8},"进入战斗20秒后，增加自身50%攻击力，持续30秒。"]
[500303,"愈战愈勇","每过8秒，增加自身10%攻击力和5%暴击，最高叠加3层.","每过10秒，增加自身10%攻击力和5%暴击，最高叠加5层.",{"$nulls":7},"每过10秒，增加自身10%攻击力和5%暴击，最高叠加5层."]
[500401,"挪移","受击后，60%对攻击者持续伤害，在6秒里总共造成90%攻击力的物理伤害。",{"$nulls":8},"受击后，60%对攻击者持续伤害，在6秒里总共造成90%攻击力的物理伤害。"]
[500402,"不悔","死亡时，回复己方全体30%最大生命值的血量。","死亡时，回复己方全体200%最大生命值的血量。",{"$nulls":7},"死亡时，回复己方全体200%最大生命值的血量。"]
[500501,"擅攻","造成的持续伤害时间延长2秒。",{"$nulls":8},"造成的持续伤害时间延长2秒。"]
[500502,"宿命","控制效果命中后，60%的概率施加30%攻击力的物理伤害。",{"$nulls":8},"控制效果命中后，60%的概率施加30%攻击力的物理伤害。"]
[500503,"宿命","控制效果命中后，40%对全体造成20%攻击力的物理伤害。",{"$nulls":8},"控制效果命中后，40%对全体造成20%攻击力的物理伤害。"]
[500504,"破锋","战斗中，增加15%攻击力。",{"$nulls":8},"战斗中，增加15%攻击力。"]
[500505,"神甲","战斗中，增加15%护甲。",{"$nulls":8},"战斗中，增加15%护甲。"]
[500506,"御魔","战斗中，增加15%魔抗。","战斗中，增加20%魔抗。",{"$nulls":7},"战斗中，增加20%魔抗。"]
[500507,"圣体","战斗中，增加20%最大生命。",{"$nulls":8},"战斗中，增加20%最大生命。"]
[500601,"死战","血量低于80%时触发控制免疫，持续8秒。每场战斗只能触发1次。",{"$nulls":8},"血量低于80%时触发控制免疫，持续8秒。每场战斗只能触发1次。"]
[500602,"战意昂扬","进入战斗10秒后，免疫控制效果，持续10秒。",{"$nulls":8},"进入战斗10秒后，免疫控制效果，持续10秒。"]
[500603,"战意昂扬","进入战斗20秒后，免疫控制效果，持续20秒。","进入战斗20秒后，免疫控制效果，持续15秒。",{"$nulls":7},"进入战斗20秒后，免疫控制效果，持续15秒。"]
[500604,"低语","免疫沉默状态。",{"$nulls":8},"免疫沉默状态。"]
[500605,"轻蔑","免疫嘲讽。",{"$nulls":8},"免疫嘲讽。"]
[500606,"强愈","免疫禁疗。",{"$nulls":8},"免疫禁疗。"]
[500607,"洞察","免疫致盲。",{"$nulls":8},"免疫致盲。"]
[500608,"化炎","免疫燃烧状态。",{"$nulls":8},"免疫燃烧状态。"]
[500609,"化毒","免疫中毒状态。",{"$nulls":8},"免疫中毒状态。"]
[500610,"固元","免疫流血状态。",{"$nulls":8},"免疫流血状态。"]
[500701,"祈祷","使用回复技能时，60%的概率提高恢复效果30%。",{"$nulls":8},"使用回复技能时，60%的概率提高恢复效果30%。"]
[500702,"神助","受击时，有30%的概率抵消50%自身攻击力的伤害。",{"$nulls":8},"受击时，有30%的概率抵消50%自身攻击力的伤害。"]
[500703,"至圣","自身增益效果超过2个时，技能伤害提升10%。",{"$nulls":8},"自身增益效果超过2个时，技能伤害提升10%。"]
[500704,"至圣","自身增益效果超过4个时，技能伤害提升25%。",{"$nulls":8},"自身增益效果超过4个时，技能伤害提升25%。"]
{"$rows_left_out":71}
{"sheet":"辅助","index":2,"n_rows":55,"n_cols":13,"rows_kept":55}
[]
[null,"品质",null,"部位",null,"职业"]
[null,2,"绿",1,"武器",0,"通用"]
[null,3,"蓝",2,"铠甲",1,"秘法"]
[null,4,"紫",3,"头饰",2,"天罚"]
[null,5,"橙",4,"鞋子",3,"武卫"]
[{"$nulls":5},4,"玄策"]
[{"$nulls":5},5,"生花"]
[null,"id命名规则"]
[null,"第一位","品质"]
[null,"第二位","部位",{"$nulls":9},410101]
[null,"第三位","职业",{"$nulls":9},400302]
[{"$nulls":12},400303]
[{"$nulls":12},400301]
[{"$nulls":12},450401]
[{"$nulls":12},450402]
[{"$nulls":12},400203]
[{"$nulls":12},400205]
[{"$nulls":12},503505]
[{"$nulls":12},414301]
[{"$nulls":12},414302]
[{"$nulls":12},414303]
[{"$nulls":12},414301]
[{"$nulls":12},414302]
[{"$nulls":12},414303]
[{"$nulls":12},400304]
[{"$nulls":12},400305]
[{"$nulls":12},400306]
[{"$nulls":12},503504]
[{"$nulls":12},414401]
[{"$nulls":12},510311]
[{"$nulls":12},500506]
[{"$nulls":12},500505]
[{"$nulls":12},500102]
[{"$nulls":12},500103]
[{"$nulls":12},500104]
[{"$nulls":12},500105]
[{"$nulls":12},500106]
[{"$nulls":12},500402]
[{"$nulls":12},400402]
{"$rows_left_out":16}
{"sheet":"Sheet2","index":3,"n_rows":521,"n_cols":7,"rows_kept":521}
[null,"角色id","技能","等级","输出技能id","技能名称","技能描述"]
[null,10001,1,1,{"$f":"[1]!SUMSTRING(B2:D2,\"\")","v":{"$error":"#NAME?"}},{"$f":"VLOOKUP(E2,Sheet1!$I:$K,3,0)","v":{"$error":"#NAME?"}},{"$f":"VLOOKUP(E2,Sheet1!$I:$L,4,0)","v":{"$error":"#NAME?"}}]
[null,10001,1,2,{"$f":"[1]!SUMSTRING(B3:D3,\"\")","v":{"$error":"#NAME?"}},{"$f":"F2","v":{"$error":"#NAME?"}},{"$f":"G2","v":{"$error":"#NAME?"}}]
[null,10001,1,3,{"$f":"[1]!SUMSTRING(B4:D4,\"\")","v":{"$error":"#NAME?"}},{"$f":"F3","v":{"$error":"#NAME?"}},{"$f":"G3","v":{"$error":"#NAME?"}}]
[null,10001,1,4,{"$f":"[1]!SUMSTRING(B5:D5,\"\")","v":{"$error":"#NAME?"}},{"$f":"F4","v":{"$error":"#NAME?"}},{"$f":"G2","v":{"$error":"#NAME?"}}]
[null,10001,1,5,{"$f":"[1]!SUMSTRING(B6:D6,\"\")","v":{"$error":"#NAME?"}},{"$f":"F5","v":{"$error":"#NAME?"}},{"$f":"G2","v":{"$error":"#NAME?"}}]
[null,10001,2,{"$f":"D2","v":1},{"$f":"[1]!SUMSTRING(B7:D7,\"\")","v":{"$error":"#NAME?"}},{"$f":"VLOOKUP(E7,Sheet1!$I:$K,3,0)","v":{"$error":"#NAME?"}},{"$f":"VLOOKUP(E7,Sheet1!$I:$L,4,0)","v":{"$error":"#NAME?"}}]
[null,10001,2,{"$f":"D3","v":2},{"$f":"[1]!SUMSTRING(B8:D8,\"\")","v":{"$error":"#NAME?"}},{"$f":"F7","v":{"$error":"#NAME?"}},{"$f":"G7","v":{"$error":"#NAME?"}}]
[null,10001,2,{"$f":"D4","v":3},{"$f":"[1]!SUMSTRING(B9:D9,\"\")","v":{"$error":"#NAME?"}},{"$f":"F8","v":{"$error":"#NAME?"}},{"$f":"G8","v":{"$error":"#NAME?"}}]
[null,10001,2,{"$f":"D5","v":4},{"$f":"[1]!SUMSTRING(B10:D10,\"\")","v":{"$error":"#NAME?"}},{"$f":"F9","v":{"$error":"#NAME?"}},{"$f":"G7","v":{"$error":"#NAME?"}}]
[null,10001,2,{"$f":"D6","v":5},{"$f":"[1]!SUMSTRING(B11:D11,\"\")","v":{"$error":"#NAME?"}},{"$f":"F10","v":{"$error":"#NAME?"}},{"$f":"G7","v":{"$error":"#NAME?"}}]
[null,{"$f":"B2+1","v":10002},{"$f":"C2","v":1},1,{"$f":"[1]!SUMSTRING(B12:D12,\"\")","v":{"$error":"#NAME?"}},{"$f":"VLOOKUP(E12,Sheet1!$I:$K,3,0)","v":{"$error":"#NAME?"}},{"$f":"VLOOKUP(E12,Sheet1!$I:$L,4,0)","v":{"$error":"#NAME?"}}]
[null,{"$f":"B3+1","v":10002},1,2,{"$f":"[1]!SUMSTRING(B13:D13,\"\")","v":{"$error":"#NAME?"}},{"$f":"F12","v":{"$error":"#NAME?"}},{"$f":"G12","v":{"$error":"#NAME?"}}]
[null,10002,1,3,{"$f":"[1]!SUMSTRING(B14:D14,\"\")","v":{"$error":"#NAME?"}},{"$error":"#NAME?"},{"$f":"G13","v":{"$error":"#NAME?"}}]
[null,10002,1,4,{"$f":"[1]!SUMSTRING(B15:D15,\"\")","v":{"$error":"#NAME?"}},{"$error":"#NAME?"},{"$f":"G12","v":{"$error":"#NAME?"}}]
[null,10002,1,5,{"$f":"[1]!SUMSTRING(B16:D16,\"\")","v":{"$error":"#NAME?"}},{"$error":"#NAME?"},{"$f":"G12","v":{"$error":"#NAME?"}}]
[null,10002,2,1,{"$f":"[1]!SUMSTRING(B17:D17,\"\")","v":{"$error":"#NAME?"}},{"$f":"VLOOKUP(E17,Sheet1!$I:$K,3,0)","v":{"$error":"#NAME?"}},{"$f":"VLOOKUP(E17,Sheet1!$I:$L,4,0)","v":{"$error":"#NAME?"}}]
[null,10002,2,2,{"$f":"[1]!SUMSTRING(B18:D18,\"\")","v":{"$error":"#NAME?"}},{"$f":"F17","v":{"$error":"#NAME?"}},{"$f":"G17","v":{"$error":"#NAME?"}}]
[null,10002,2,3,{"$f":"[1]!SUMSTRING(B19:D19,\"\")","v":{"$error":"#NAME?"}},{"$error":"#NAME?"},{"$f":"G18","v":{"$error":"#NAME?"}}]
[null,10002,2,4,{"$f":"[1]!SUMSTRING(B20:D20,\"\")","v":{"$error":"#NAME?"}},{"$error":"#NAME?"},{"$f":"G17","v":{"$error":"#NAME?"}}]
[null,10002,2,5,{"$f":"[1]!SUMSTRING(B21:D21,\"\")","v":{"$error":"#NAME?"}},{"$error":"#NAME?"},{"$f":"G17","v":{"$error":"#NAME?"}}]
[null,10003,1,1,{"$f":"[1]!SUMSTRING(B22:D22,\"\")","v":{"$error":"#NAME?"}},{"$f":"VLOOKUP(E22,Sheet1!$I:$K,3,0)","v":{"$error":"#NAME?"}},{"$f":"VLOOKUP(E22,Sheet1!$I:$L,4,0)","v":{"$error":"#NAME?"}}]
[null,10003,1,2,{"$f":"[1]!SUMSTRING(B23:D23,\"\")","v":{"$error":"#NAME?"}},{"$f":"F22","v":{"$error":"#NAME?"}},{"$f":"G22","v":{"$error":"#NAME?"}}]
[null,10003,1,3,{"$f":"[1]!SUMSTRING(B24:D24,\"\")","v":{"$error":"#NAME?"}},{"$error":"#NAME?"},{"$f":"G23","v":{"$error":"#NAME?"}}]
[null,10003,1,4,{"$f":"[1]!SUMSTRING(B25:D25,\"\")","v":{"$error":"#NAME?"}},{"$error":"#NAME?"},{"$f":"G22","v":{"$error":"#NAME?"}}]
[null,10003,1,5,{"$f":"[1]!SUMSTRING(B26:D26,\"\")","v":{"$error":"#NAME?"}},{"$error":"#NAME?"},{"$f":"G22","v":{"$error":"#NAME?"}}]
[null,10003,2,1,{"$f":"[1]!SUMSTRING(B27:D27,\"\")","v":{"$error":"#NAME?"}},{"$f":"VLOOKUP(E27,Sheet1!$I:$K,3,0)","v":{"$error":"#NAME?"}},{"$f":"VLOOKUP(E27,Sheet1!$I:$L,4,0)","v":{"$error":"#NAME?"}}]
[null,10003,2,2,{"$f":"[1]!SUMSTRING(B28:D28,\"\")","v":{"$error":"#NAME?"}},{"$f":"F27","v":{"$error":"#NAME?"}},{"$f":"G27","v":{"$error":"#NAME?"}}]
[null,10003,2,3,{"$f":"[1]!SUMSTRING(B29:D29,\"\")","v":{"$error":"#NAME?"}},{"$error":"#NAME?"},{"$f":"G28","v":{"$error":"#NAME?"}}]
[null,10003,2,4,{"$f":"[1]!SUMSTRING(B30:D30,\"\")","v":{"$error":"#NAME?"}},{"$error":"#NAME?"},{"$f":"G27","v":{"$error":"#NAME?"}}]
[null,10003,2,5,{"$f":"[1]!SUMSTRING(B31:D31,\"\")","v":{"$error":"#NAME?"}},{"$error":"#NAME?"},{"$f":"G27","v":{"$error":"#NAME?"}}]
[null,10004,{"$f":"C22","v":1},1,{"$f":"[1]!SUMSTRING(B32:D32,\"\")","v":{"$error":"#NAME?"}},{"$f":"VLOOKUP(E32,Sheet1!$I:$K,3,0)","v":{"$error":"#NAME?"}},{"$f":"VLOOKUP(E32,Sheet1!$I:$L,4,0)","v":{"$error":"#NAME?"}}]
[null,10004,1,2,{"$f":"[1]!SUMSTRING(B33:D33,\"\")","v":{"$error":"#NAME?"}},{"$f":"F32","v":{"$error":"#NAME?"}},{"$f":"G32","v":{"$error":"#NAME?"}}]
[null,10004,1,3,{"$f":"[1]!SUMSTRING(B34:D34,\"\")","v":{"$error":"#NAME?"}},{"$error":"#NAME?"},{"$f":"G33","v":{"$error":"#NAME?"}}]
[null,10004,1,4,{"$f":"[1]!SUMSTRING(B35:D35,\"\")","v":{"$error":"#NAME?"}},{"$error":"#NAME?"},{"$f":"G32","v":{"$error":"#NAME?"}}]
[null,10004,1,5,{"$f":"[1]!SUMSTRING(B36:D36,\"\")","v":{"$error":"#NAME?"}},{"$error":"#NAME?"},{"$f":"G32","v":{"$error":"#NAME?"}}]
[null,10004,2,1,{"$f":"[1]!SUMSTRING(B37:D37,\"\")","v":{"$error":"#NAME?"}},{"$f":"VLOOKUP(E37,Sheet1!$I:$K,3,0)","v":{"$error":"#NAME?"}},{"$f":"VLOOKUP(E37,Sheet1!$I:$L,4,0)","v":{"$error":"#NAME?"}}]
[null,10004,2,2,{"$f":"[1]!SUMSTRING(B38:D38,\"\")","v":{"$error":"#NAME?"}},{"$f":"F37","v":{"$error":"#NAME?"}},{"$f":"G37","v":{"$error":"#NAME?"}}]
[null,10004,2,3,{"$f":"[1]!SUMSTRING(B39:D39,\"\")","v":{"$error":"#NAME?"}},{"$error":"#NAME?"},{"$f":"G38","v":{"$error":"#NAME?"}}]
[null,10004,2,4,{"$f":"[1]!SUMSTRING(B40:D40,\"\")","v":{"$error":"#NAME?"}},{"$error":"#NAME?"},{"$f":"G37","v":{"$error":"#NAME?"}}]
{"$rows_left_out":482}
{"sheet":"Sheet1","index":4,"n_rows":104,"n_cols":12,"rows_kept":104}
[10001,"石御霏",{"$nulls":3},10001,1,1,"1000111",{"$f":"VLOOKUP(F1,$A:$B,2,0)","v":"石御霏"},{"$f":"VLOOKUP(J1,[2]特效需求!$A$5:$F$5664,6,0)","v":"凌甲"},{"$f":"VLOOKUP(J1,[2]特效需求!A$5:G$56,7,FALSE)","v":"对敌方单体造成灵魂力%的水属性物理伤害，\n对自身有%的概率(+效果命中)造成嘲讽，并提升护甲%，持续x秒。"}]
[10002,"楚恒",{"$nulls":3},10002,1,1,"1000211",{"$f":"VLOOKUP(F2,$A:$B,2,0)","v":"楚恒"},{"$f":"VLOOKUP(J2,[2]特效需求!$A$5:$F$5664,6,0)","v":"啸牙"},{"$f":"VLOOKUP(J2,[2]特效需求!A$5:G$56,7,FALSE)","v":"对敌方单体造成灵魂力%的风属性物理伤害，\n对自身有%的概率(+效果命中)造成嘲讽，并提升灵魂力%，持续x秒。"}]
[10003,"夏侯鸿天",{"$nulls":3},10003,1,1,"1000311",{"$f":"VLOOKUP(F3,$A:$B,2,0)","v":"夏侯鸿天"},{"$f":"VLOOKUP(J3,[2]特效需求!$A$5:$F$5664,6,0)","v":"断鸿"},{"$f":"VLOOKUP(J3,[2]特效需求!A$5:G$56,7,FALSE)","v":"对敌方单体造成灵魂力%的地属性物理伤害，\n将造成伤害的%转化为生命"}]
[10004,"应茹",{"$nulls":3},10004,1,1,"1000411","应茹",{"$f":"VLOOKUP(J4,[2]特效需求!$A$5:$F$5664,6,0)","v":"轻流"},{"$f":"VLOOKUP(J4,[2]特效需求!A$5:G$56,7,FALSE)","v":"对敌方单体造成灵魂力%的风属性魔法伤害，\n为当前生命最低的x名队友在x秒内，每秒恢复灵魂力%的生命"}]
[10005,"端木葵",{"$nulls":3},10005,1,1,"1000511","端木葵",{"$f":"VLOOKUP(J5,[2]特效需求!$A$5:$F$5664,6,0)","v":"长槐琼灯"},{"$f":"VLOOKUP(J5,[2]特效需求!A$5:G$56,7,FALSE)","v":"对敌方单体造成灵魂力%的地属性魔法伤害，\n恢复自身灵魂力%的生命，\n持续x秒灵魂力增加25%"}]
[10006,"兰卿",{"$nulls":3},10006,1,1,"1000611","兰卿",{"$f":"VLOOKUP(J6,[2]特效需求!$A$5:$F$5664,6,0)","v":"阳炎破阵曲"},{"$f":"VLOOKUP(J6,[2]特效需求!A$5:G$56,7,FALSE)","v":"对敌方全体造成灵魂力%的火属性魔法伤害，\n在x秒内，友方全体灵魂力增加%"}]
[10007,"靖之",{"$nulls":3},10007,1,1,"1000711","靖之",{"$f":"VLOOKUP(J7,[2]特效需求!$A$5:$F$5664,6,0)","v":"破甲裂"},{"$f":"VLOOKUP(J7,[2]特效需求!A$5:G$56,7,FALSE)","v":"对随机3名敌方造成灵魂力%的水属性物理伤害，\n造成伤害后，在x秒内降低目标%的护甲"}]
[10008,"白梦凡",{"$nulls":3},10008,1,1,"1000811","白梦凡",{"$f":"VLOOKUP(J8,[2]特效需求!$A$5:$F$5664,6,0)","v":"幻境之瞳"},{"$f":"VLOOKUP(J8,[2]特效需求!A$5:G$56,7,FALSE)","v":"对敌方单体造成灵魂力%的光属性魔法伤害，\n对生花类妖灵师造成额外%伤害。"}]
[10009,"祁菲",{"$nulls":3},10009,1,1,"1000911","祁菲",{"$f":"VLOOKUP(J9,[2]特效需求!$A$5:$F$5664,6,0)","v":"黑符"},{"$f":"VLOOKUP(J9,[2]特效需求!A$5:G$56,7,FALSE)","v":"对随机3名敌人造成灵魂力%的暗属性物理伤害，\n造成伤害时，在x秒内对敌人造成燃烧效果，\n燃烧效果持续期间，每秒造成灵魂力%的伤害。"}]
[10010,"颜祈佳",{"$nulls":3},10010,1,1,"1001011","颜祈佳",{"$f":"VLOOKUP(J10,[2]特效需求!$A$5:$F$5664,6,0)","v":"涡流"},{"$f":"VLOOKUP(J10,[2]特效需求!A$5:G$56,7,FALSE)","v":"对随机3名敌人造成灵魂力%的水属性魔法伤害，\n对武卫类妖灵师造成额外%伤害。"}]
[10011,"叶延",{"$nulls":3},10011,1,1,"1001111","叶延",{"$f":"VLOOKUP(J11,[2]特效需求!$A$5:$F$5664,6,0)","v":"地灵咒"},{"$f":"VLOOKUP(J11,[2]特效需求!A$5:G$56,7,FALSE)","v":"对随机2名敌人造成灵魂力%的地属性魔法伤害，\n造成伤害时，在x秒内对敌人造成中毒效果，\n中毒效果持续期间，每秒造成灵魂力%的伤害。"}]
[10012,"慕容子期",{"$nulls":3},10012,1,1,"1001211","慕容子期",{"$f":"VLOOKUP(J12,[2]特效需求!$A$5:$F$5664,6,0)","v":"焚花"},{"$f":"VLOOKUP(J12,[2]特效需求!A$5:G$56,7,FALSE)","v":"对敌方单体造成灵魂力%的火属性物理伤害，\n施展技能后，冷却时间增加x秒，\n造成伤害时，为敌人附加1层中毒效果，最多叠加x层。"}]
[10013,"云灵",{"$nulls":3},10013,1,1,"1001311","云灵",{"$f":"VLOOKUP(J13,[2]特效需求!$A$5:$F$5664,6,0)","v":"黑泉利箭"},{"$f":"VLOOKUP(J13,[2]特效需求!A$5:G$56,7,FALSE)","v":"对敌方单体造成灵魂力%的地属性物理伤害，\n在x秒内，暴击率增加%，\n在x秒内，暴击伤害增加%。"}]
[10014,"耿陶",{"$nulls":3},10014,1,1,"1001411","耿陶",{"$f":"VLOOKUP(J14,[2]特效需求!$A$5:$F$5664,6,0)","v":"墨意"},{"$f":"VLOOKUP(J14,[2]特效需求!A$5:G$56,7,FALSE)","v":"对敌方2名敌人造成灵魂力%的暗属性物理伤害，\n造成伤害时，有%的概率（+效果命中）降低其%护甲，\n造成伤害时，有%的概率（+效果命中）沉默x秒。"}]
[10015,"云",{"$nulls":3},10015,1,1,"1001511","云",{"$f":"VLOOKUP(J15,[2]特效需求!$A$5:$F$5664,6,0)","v":"辉映"},{"$f":"VLOOKUP(J15,[2]特效需求!A$5:G$56,7,FALSE)","v":"对敌方单体造成灵魂力%的光属性魔法伤害，\n将造成伤害的%转化为自身生命"}]
[10016,"岑以航",{"$nulls":3},10016,1,1,"1001611","岑以航",{"$f":"VLOOKUP(J16,[2]特效需求!$A$5:$F$5664,6,0)","v":"无明火"},{"$f":"VLOOKUP(J16,[2]特效需求!A$5:G$56,7,FALSE)","v":"对敌方单体造成灵魂力%的火属性魔法伤害，\n对异常状态的敌人造成伤害时，无视敌人38%抗性"}]
[10017,"影蓟",{"$nulls":3},10017,1,1,"1001711",{"$f":"VLOOKUP(F17,$A:$B,2,0)","v":"影蓟"},{"$f":"VLOOKUP(J17,[2]特效需求!$A$5:$F$5664,6,0)","v":"晦影"},{"$f":"VLOOKUP(J17,[2]特效需求!A$5:G$56,7,FALSE)","v":"对随机2名敌人造成灵魂力%的暗属性魔法伤害，\n造成伤害时，有%的概率（+效果命中）在x秒内护甲降低%\n造成伤害时，有%的概率（+效果命中）沉默x秒"}]
[10018,"朱贺",{"$nulls":3},10018,1,1,"1001811","朱贺",{"$f":"VLOOKUP(J18,[2]特效需求!$A$5:$F$5664,6,0)","v":"天照"},{"$f":"VLOOKUP(J18,[2]特效需求!A$5:G$56,7,FALSE)","v":"对敌方单体造成灵魂力%的光属性魔法伤害，\n造成伤害时，在x秒内对敌人造成流血效果，\n流血效果持续期间，每秒造成灵魂力%的伤害。"}]
[10019,"孔谦",{"$nulls":3},10019,1,1,"1001911","孔谦",{"$f":"VLOOKUP(J19,[2]特效需求!$A$5:$F$5664,6,0)","v":"辰变"},{"$f":"VLOOKUP(J19,[2]特效需求!A$5:G$56,7,FALSE)","v":"对敌方单体造成灵魂力%的风属性物理伤害，\n施展技能后，在x秒内增加自身%灵魂力，%的暴击伤害。"}]
[10020,"颜无雍",{"$nulls":3},10020,1,1,"1002011","颜无雍",{"$f":"VLOOKUP(J20,[2]特效需求!$A$5:$F$5664,6,0)","v":"天回"},{"$f":"VLOOKUP(J20,[2]特效需求!A$5:G$56,7,FALSE)","v":"对随机3名敌人造成灵魂力%的火属性物理伤害，\n为随机恢复2名友方恢复灵魂力%的生命。"}]
[10021,"岑以璇",{"$nulls":3},10021,1,1,"1002111","岑以璇",{"$f":"VLOOKUP(J21,[2]特效需求!$A$5:$F$5664,6,0)","v":"水玉缚灵"},{"$f":"VLOOKUP(J21,[2]特效需求!A$5:G$56,7,FALSE)","v":"对敌方单体造成灵魂力%的水属性魔法伤害，\n造成伤害时，有%的概率（+效果命中）眩晕x秒。"}]
[10022,"颜无诡",{"$nulls":3},10022,1,1,"1002211","颜无诡",{"$f":"VLOOKUP(J22,[2]特效需求!$A$5:$F$5664,6,0)","v":"煞气"},{"$f":"VLOOKUP(J22,[2]特效需求!A$5:G$56,7,FALSE)","v":"对敌方单体造成灵魂力%的风属性魔法伤害，\n造成伤害时，有%的概率（+效果命中）眩晕x秒。"}]
[10023,"荧荧",{"$nulls":3},10023,1,1,"1002311","荧荧",{"$f":"VLOOKUP(J23,[2]特效需求!$A$5:$F$5664,6,0)","v":"雷罚"},{"$f":"VLOOKUP(J23,[2]特效需求!A$5:G$56,7,FALSE)","v":"对敌方单体造成灵魂力%的光属性魔法伤害，\n在x秒内，抗性增加%"}]
[10024,"许槿然",{"$nulls":3},10024,1,1,"1002411","许槿然",{"$f":"VLOOKUP(J24,[2]特效需求!$A$5:$F$5664,6,0)","v":"风烈打"},{"$f":"VLOOKUP(J24,[2]特效需求!A$5:G$56,7,FALSE)","v":"对敌方单体造成灵魂力%的风属性物理伤害，\n造成伤害时，有%的概率（+效果命中）眩晕x秒。"}]
[10025,"唐萱",{"$nulls":3},10025,1,1,"1002511","唐萱",{"$f":"VLOOKUP(J25,[2]特效需求!$A$5:$F$5664,6,0)","v":"宣火符"},{"$f":"VLOOKUP(J25,[2]特效需求!A$5:G$56,7,FALSE)","v":"对敌方单体造成灵魂力%的火属性魔法伤害，\n造成伤害时，有%的概率（+效果命中）眩晕x秒。"}]
[10026,"孙晴",{"$nulls":3},10026,1,1,"1002611","孙晴",{"$f":"VLOOKUP(J26,[2]特效需求!$A$5:$F$5664,6,0)","v":"敲山震虎"},{"$f":"VLOOKUP(J26,[2]特效需求!A$5:G$56,7,FALSE)","v":"对随机2名敌方造成灵魂力%的光属性物理伤害，\n对天罚类妖灵师造成额外%伤害。"}]
[10027,"宁月",{"$nulls":3},10027,1,1,"1002711","宁月",{"$f":"VLOOKUP(J27,[2]特效需求!$A$5:$F$5664,6,0)","v":"应援"},{"$f":"VLOOKUP(J27,[2]特效需求!A$5:G$56,7,FALSE)","v":"对敌方单体造成灵魂力%的光属性物理伤害，\n为随机1名友方恢复灵魂力%的生命。"}]
[10028,"紫川",{"$nulls":3},10028,1,1,"1002811","紫川",{"$f":"VLOOKUP(J28,[2]特效需求!$A$5:$F$5664,6,0)","v":"落英之舞"},{"$f":"VLOOKUP(J28,[2]特效需求!A$5:G$56,7,FALSE)","v":"对随机2名敌方造成灵魂力%的光属性魔法伤害，\n对武卫类妖灵师造成额外%伤害。"}]
[10029,"晏息",{"$nulls":3},10029,1,1,"1002911",{"$f":"VLOOKUP(F29,$A:$B,2,0)","v":"晏息"},{"$f":"VLOOKUP(J29,[2]特效需求!$A$5:$F$5664,6,0)","v":"昙华动地"},{"$f":"VLOOKUP(J29,[2]特效需求!A$5:G$56,7,FALSE)","v":"对随机2名敌方造成灵魂力%的地属性魔法伤害。"}]
[10030,"瑶瑶",{"$nulls":3},10030,1,1,"1003011","瑶瑶",{"$f":"VLOOKUP(J30,[2]特效需求!$A$5:$F$5664,6,0)","v":"碧砂"},{"$f":"VLOOKUP(J30,[2]特效需求!A$5:G$56,7,FALSE)","v":"对敌方单体造成灵魂力%的风属性魔法伤害，\n造成伤害时，有%的概率（+效果命中）沉默x秒。"}]
[10031,"贾裴武",{"$nulls":3},10031,1,1,"1003111","贾裴武",{"$f":"VLOOKUP(J31,[2]特效需求!$A$5:$F$5664,6,0)","v":"破邪二连"},{"$f":"VLOOKUP(J31,[2]特效需求!A$5:G$56,7,FALSE)","v":"对随机2名敌方造成灵魂力%的地属性物理伤害，\n对秘法类妖灵师造成额外%伤害。"}]
[10032,"雷燕",{"$nulls":3},10032,1,1,"1003211","雷燕",{"$f":"VLOOKUP(J32,[2]特效需求!$A$5:$F$5664,6,0)","v":"天雷地火"},{"$f":"VLOOKUP(J32,[2]特效需求!A$5:G$56,7,FALSE)","v":"对敌方单体造成灵魂力%的地属性物理伤害，\n造成伤害时，在x秒内对敌人造成燃烧效果，\n燃烧效果持续期间，每秒造成灵魂力%的伤害。"}]
[10033,"辛夷",{"$nulls":3},10033,1,1,"1003311","辛夷",{"$f":"VLOOKUP(J33,[2]特效需求!$A$5:$F$5664,6,0)","v":"隐遁"},{"$f":"VLOOKUP(J33,[2]特效需求!A$5:G$56,7,FALSE)","v":"对随机2名敌方造成灵魂力%的地属性物理伤害，\n对武卫类妖灵师造成额外%伤害。"}]
[10034,"伏冥",{"$nulls":3},10034,1,1,"1003411","伏冥",{"$f":"VLOOKUP(J34,[2]特效需求!$A$5:$F$5664,6,0)","v":"辟魂"},{"$f":"VLOOKUP(J34,[2]特效需求!A$5:G$56,7,FALSE)","v":"对敌方单体造成灵魂力%的暗属性魔法伤害，\n造成伤害时，有%的概率（+效果命中）眩晕x秒。"}]
[10035,"司空染",{"$nulls":3},10035,1,1,"1003511","司空染",{"$f":"VLOOKUP(J35,[2]特效需求!$A$5:$F$5664,6,0)","v":"血影迷踪"},{"$f":"VLOOKUP(J35,[2]特效需求!A$5:G$56,7,FALSE)","v":"对随机3名敌方造成灵魂力%的暗属性物理伤害，\n有%的概率（+效果命中）对生花类妖灵师造成虚弱效果。"}]
[10036,"解幽",{"$nulls":3},10036,1,1,"1003611","解幽",{"$f":"VLOOKUP(J36,[2]特效需求!$A$5:$F$5664,6,0)","v":"深海冥灵"},{"$f":"VLOOKUP(J36,[2]特效需求!A$5:G$56,7,FALSE)","v":"对随机2名敌方造成灵魂力%的水属性魔法伤害，\n对天罚类妖灵师造成额外%伤害。"}]
[10037,"薛苓",{"$nulls":3},10037,1,1,"1003711","薛苓",{"$f":"VLOOKUP(J37,[2]特效需求!$A$5:$F$5664,6,0)","v":"凝霜箭"},{"$f":"VLOOKUP(J37,[2]特效需求!A$5:G$56,7,FALSE)","v":"对敌方单体造成灵魂力%的水属性物理伤害，\n在x秒内，自身抗性增加%"}]
[10038,"常申",{"$nulls":3},10038,1,1,"1003811","常申",{"$f":"VLOOKUP(J38,[2]特效需求!$A$5:$F$5664,6,0)","v":"火相炎流"},{"$f":"VLOOKUP(J38,[2]特效需求!A$5:G$56,7,FALSE)","v":"对敌方单体造成灵魂力%的火属性魔法伤害，\n造成伤害时，武卫类妖灵师降低%抗性，降低%护甲。"}]
[10039,"呼延腾",{"$nulls":3},10039,1,1,"1003911","呼延腾",{"$f":"VLOOKUP(J39,[2]特效需求!$A$5:$F$5664,6,0)","v":"寒芒刺"},{"$f":"VLOOKUP(J39,[2]特效需求!A$5:G$56,7,FALSE)","v":"对敌方单体造成灵魂力%的水属性物理伤害，\n造成伤害时，在x秒内降低敌人护甲%"}]
[10040,"冉宜",{"$nulls":3},10040,1,1,"1004011","冉宜",{"$f":"VLOOKUP(J40,[2]特效需求!$A$5:$F$5664,6,0)","v":"煌炎斩"},{"$f":"VLOOKUP(J40,[2]特效需求!A$5:G$56,7,FALSE)","v":"对随机2名敌人造成灵魂力%的火属性物理伤害，\n对玄策类妖灵师造成额外%伤害。"}]
{"$rows_left_out":65}
{"sheet":"汇总","index":5,"n_rows":144,"n_cols":15,"rows_kept":144}
["技能id","技能名称","技能描述","装备id","装备名称","装备id","装备名称","装备id","装备名称","装备id","装备名称","装备id","装备名称","装备id","装备名称"]
[210001,"强击","造成伤害时，额外增加100点伤害。",52018,"轻灵法杖",52038,"轻灵之刺",52058,"轻灵矛",52078,"轻灵长刀",52098,"轻灵法杖"]
[210002,"愈合","进入战斗后，每1秒回复20生命。",52019,"先知法杖",52039,"先知之刺",52059,"先知矛",52079,"先知长刀",52099,"先知法杖"]
[210003,"嗜血","造成伤害时，将伤害的2%转化为自身生命。",52020,"杀戮法杖",52040,"杀戮之刺",52060,"杀戮矛",52080,"杀戮长刀",52100,"杀戮法杖"]
[310001,"破甲","发动技能后，减少目标50点护甲，持续整场战斗，最多可减少400点。",53011,"逐光法杖",53025,"逐光之刺",53039,"逐光大矛",53053,"逐光长剑",53067,"逐光法杖"]
[310002,"骄击","造成的伤害暴击时，有10%的概率造成200%的暴击伤害。",53012,"轻尘法杖",53026,"轻尘之刺",53040,"轻尘大矛",53054,"轻尘长剑",53068,"轻尘法杖"]
[310003,"强击","造成伤害时，额外增加200点伤害。",53013,"洞察法杖",53027,"洞察之刺",53041,"洞察大矛",53055,"洞察长剑",53069,"洞察法杖"]
[310004,"愈合","进入战斗后，每1秒回复35生命。",53014,"屠戮法杖",53028,"屠戮之刺",53042,"屠戮大矛",53056,"屠戮长剑",53070,"屠戮法杖"]
[411001,"化神","发动技能时，40%的概率将魔抗的20%视作额外攻击。",54008,"踏江短杖"]
[411002,"湮灭","造成的伤害暴击后，60%的概率施加10%攻击的持续魔法伤害，持续3秒。",54009,"悬河短杖"]
[411003,"伏击","发动技能后，20%的概率对敌方随机1名施加50%攻击的魔法伤害。",54010,"镜湖短杖"]
[411004,"破锋","战斗中，增加10%攻击力。",54011,"止玄短杖"]
[411005,"天御","战斗中，增加10%伤害减免。",54012,"无锋短杖"]
[411006,"斩神","战斗中，增加5%暴击率。",54013,"千钧短杖"]
[411007,"精术","战斗中，增加5%效果命中。",54014,"撼岳短杖"]
[412001,"战意昂扬","进入战斗10秒后，免疫控制效果，持续10秒。",54022,"踏江长剑"]
[412002,"战甲","发动技能时，40%的概率将护甲的20%视作额外攻击。",54023,"悬河之刺"]
[412003,"无畏","对血量高于60%的敌人伤害提高30%。",54024,"镜湖之刺"]
[412004,"破空","战斗中，增加20%暴击伤害。",54025,"止玄之刺"]
[412005,"迅雷","战斗中，增加634点速度。",54026,"无锋之刺"]
[412006,"斩神","战斗中，增加5%暴击率。",54027,"千钧之刺"]
[412007,"破锋","战斗中，增加10%攻击力。",54028,"撼岳之刺"]
[413001,"神甲","发动技能后，增加自身护甲200点,持续8秒。",54036,"踏江战戟"]
[413002,"反击","受击后，有10%的概率对随机1人造成护甲的20%的真实伤害。",54037,"悬河战戟"]
[413003,"向死而生","受击后,10%的概率，回复自身最大生命值6%的血量。",54038,"镜湖战戟"]
[413004,"精术","战斗中，增加5%效果命中。",54039,"止玄战矛"]
[413005,"回春","战斗中，增加10%受到的治疗效果。",54040,"无锋战矛"]
[413006,"圣体","战斗中，增加10%最大生命值。",54041,"千钧战矛"]
[413007,"天御","战斗中，增加10%伤害减免。",54042,"撼岳战矛"]
[414001,"混乱","发动技能后，有20%的概率眩晕敌方其中1人，持续3秒。",54050,"踏江之刃"]
[414002,"命运","控制效果命中后，50%的概率追加30%的魔法伤害。",54051,"悬河之刃"]
[414003,"擅攻","造成的持续伤害时间延长1秒。",54052,"镜湖之刃"]
[414004,"精术","战斗中，增加5%效果命中。",54053,"止玄之刃"]
[414005,"迅雷","战斗中，增加634点速度。",54054,"无锋之刃"]
[414006,"天伤","战斗中，增加10%伤害。",54055,"千钧之刃"]
[414007,"破锋","战斗中，增加10%攻击力。",54056,"撼岳之刃"]
[415001,"不倒","受击后,40%的概率，回复自身40%攻击的血量。",54064,"踏江法杖"]
[415002,"风驰电掣","发动技能后，增加自身200点速度,持续5秒。",54065,"悬河秘录"]
[415003,"妙手","发动技能后，30%的概率回复我方攻击最高的1人的10%攻击的血量，持续5秒。",54066,"镜湖秘录"]
[415004,"破锋","战斗中，增加10%攻击力。",54067,"止玄秘录"]
{"$rows_left_out":104}