{"text_format":"3","workbook":"xlsx","n_sheets":10,"sheets":["SkillLogicConfig","技能效果附表","辅助","Sheet1","Sheet2","Sheet3","结构解析规则","怪物技能辅助表","Sheet4","爬塔怪物技能设计"],"not_rendered":{"defined_names":3,"comments":2},"read":"whole","date_system":"1900"}

{"sheet":"SkillLogicConfig","index":0,"n_rows":1807,"n_cols":13,"rows_kept":1807}
[null,"Id","Target","Effect","EffectValue","CD","SkillDisplay","NoUse1","NoUse2","NoUse3","NoUse6","NoUse4","NoUse5"]
[null,"int","mut,float#float,2","mut,int#int,2","mut,float#float,2","float","int","string","string","string","string","string","string"]
[null,2,2,2,2,2,2,0,0,0,0,0,0]
[null,"技能id","目标选择","技能效果组合","技能效果参数","上滑技施法时间","技能特效引用","备注","备注","备注","空值校验","目标校验","效果校验"]
["默认值",0,"null","null","null",0,0]
["正确性校对"]
["校对值"]
[null,1,"400001#0.4","1#3","0.1#1|1#2#5",null,null,"沉默",null,null,{"$f":"IF(AND(ISBLANK(C8)=ISBLANK(D8),ISBLANK(D8)=ISBLANK(E8),ISBLANK(E8)=ISBLANK(C8)),\"\",FALSE)","v":""},{"$f":"IF((LEN(C8)-LEN(SUBSTITUTE(C8,\"|\",\"\")))=(LEN(D8)-LEN(SUBSTITUTE(D8,\"|\",\"\"))),\"\",FALSE)","v":""},{"$f":"IF((LEN(D8)-LEN(SUBSTITUTE(SUBSTITUTE(D8,\"|\",\"\"),\"#\",\"\")))=(LEN(E8)-LEN(SUBSTITUTE(E8,\"|\",\"\"))),\"\",FALSE)","v":""}]
[null,2,"400001#0.4","1#3","0.1#2|1#1#2",null,null,"晕",null,null,"","",""]
[null,3,"100000#0.4",5,"1#1#4",null,null,"持续治疗",null,null,"","",""]
[null,4,"300001#0.4",13,"1#0.1#1#10",null,null,"自己燃烧",null,null,"","",""]
[null,5,"300001#0.4",13,"2#0.1#1#10",null,null,"自己中毒",null,null,"","",""]
[null,6,"300001#0.4",13,"3#0.1#1#10",null,null,"自己流血",null,null,"","",""]
[null,7,"400001#0.4",13,"1#0.1#1#10",null,null,"敌人燃烧",{"$nulls":3},""]
[null,8,"400001#0.4",13,"2#0.1#1#10",null,null,"敌人中毒",{"$nulls":3},""]
[null,9,"400001#0.4",13,"3#0.1#1#10",null,null,"敌人流血",{"$nulls":3},""]
[null,10,"300001#0.4",9,"12#0.1#10#0",null,null,"盾",{"$nulls":3},""]
[null,11,"200000#0.4",4,"1#0.5#10#4",null,null,"减攻",{"$nulls":3},""]
[null,12,"100000#0.4",4,"2#0.3#10#2",null,null,"加防",{"$nulls":3},""]
[null,13,"400001#0.4",1,"0.1#1",{"$nulls":5},{"$f":"IF(AND(ISBLANK(C20)=ISBLANK(D20),ISBLANK(D20)=ISBLANK(E20),ISBLANK(E20)=ISBLANK(C20)),\"\",FALSE)","v":""},"",{"$f":"IF((LEN(D20)-LEN(SUBSTITUTE(SUBSTITUTE(D20,\"|\",\"\"),\"#\",\"\")))=(LEN(E20)-LEN(SUBSTITUTE(E20,\"|\",\"\"))),\"\",FALSE)","v":""}]
{"$rows_left_out":1788}
{"sheet":"技能效果附表","index":1,"n_rows":121,"n_cols":38,"rows_kept":121}
[]
[]
[]
[null,"描述","参数类型","备注修改时间"]
[1,"造成[a]%的[b]伤害","a[float],b[伤害类型]"]
[2,"造成[a]%的[b]伤害【AOE】","a[float],b[伤害类型]"]
[3,"[a]%概率[b]，持续[c]回合","a[float],b[控制状态],c[int]","2020-03-26"]
[4,"[d]改变[a]属性[b]%,持续[c]回合","a[属性],b[float],c[int],d[改变类型]","2020-03-26"]
[5,"持续恢复[a]*[b]%生命，持续[c]秒","a[属性],b[float],c[int]"]
[6,"造成[a]到[b]次[c]%的[d]伤害","a[int],b[int],c[float],d[伤害类型]",{"$nulls":6},"清除正在使用中的技能CD最长的技能的CD"]
[7,"造成[a]到[b]次[c]%的[d]伤害【AOE】","a[int],b[int],c[float],d[伤害类型]"]
[8,"[b]%改变[c]下次重击技能CD[a]秒   （0代表清除所有）","a[float],b[float],c[改变类型]",{"$nulls":34},"叛军士兵3_1"]
[9,"添加[a]的[b]%护盾,持续[c]回合,盾消失的时候反射吸收伤害的[d]%","a[属性],b[float],c[int],d[float]","2020-03-31"]
[10,"造成[a]%的[b]伤害，自身恢复造成伤害[c]%的生命","a[float],b[伤害类型],c[float]"]
[11,"造成[a]%的[b]伤害，对[c]造成额外[d]%伤害","a[float],b[伤害类型,]c[职业],d[float]"]
[12,"每秒造成[a]的[b]的伤害，持续[c]秒","a[float]b[伤害类型]c[int]","2020-03-31"]
[13,"造成[a]，每秒造成[b]的[c]的伤害，持续[d]秒","a[持续伤害类型]b[float]c[伤害类型],d[int]","2020-03-31"]
["14(废)","造成[a]%的[b]伤害,[c]%概率[d]专属伤害加深印记(如果有印记，无印记伤害*（1+印记数量*[e]）（减益印记，不可驱散）","a[float],b[伤害类型],c[float],d[角色id],e[float]"]
[14,"造成[a]%的[b]伤害,[c]%概率[d]专属伤害加深印记(如果有印记，无印记伤害*（1+印记数量*[e]）,印记最多叠加[f]层。（减益印记，不可驱散）","a[float],b[伤害类型],c[float],d[角色id],e[float],f[float]","2019-04-16"]
[15,"造成[a]%的[b]伤害，如果击杀，则其他人再受到此次伤害的[c]%的伤害","a[float],b[伤害类型],c[float]"]
{"$rows_left_out":102}
{"sheet":"辅助","index":2,"n_rows":52,"n_cols":40,"rows_kept":52}
["[属性]","描述","[职业]","描述",null,"[控制状态]",null,null,"[伤害类型]",{"$nulls":3},"[持续回复状态]",null,null,"[持续伤害状态]",{"$nulls":3},"[改变类型]",null,"a(当前属性) oa（战斗初始属性）b（增量）",{"$nulls":6},"[免疫buff]",null,null,"[清除状态]",null,null,"元素",null,"位置",null,"战斗外数据"]
[1,"攻击",1,"战士",null,0,"代表所有",null,1,"物理伤害",null,null,0,"代表所有",null,null,0,"代表所有",null,null,1,"加算","a+b","增益",{"$nulls":4},0,"负面状态"]
[2,"护甲",2,"牧师",null,1,"眩晕",null,2,"魔法伤害",null,null,1,"持续恢复生命",null,null,1,"灼烧",null,null,2,"乘算","a+oa*b","增益","对基础属性其效果，不是当前属性",{"$nulls":3},1,"控制状态",null,1,"持续恢复",null,1,"火",1,"前排",1,"夜明珠数量"]
[3,"魔抗",3,"法师",null,2,"沉默",{"$nulls":9},2,"中毒",null,null,3,"减算","a-b","减益",{"$nulls":4},2,"持续伤害状态",null,2,"护盾",null,2,"风",2,"后排",2,"当前猎妖之路层数"]
[4,"速度",4,"刺客",null,3,"嘲讽",{"$nulls":9},3,"流血",null,null,4,"乘减算","a*(1-b)","减益","对当前属性其效果，不是基础属性",{"$nulls":6},3,"增益状态",null,3,"水",null,null,3,"紫色圣物数量"]
[5,"伤害加成",5,"游侠",null,4,"禁疗","（改状态下，技能目标选择无效，改为随机打，打击数量不变）",{"$nulls":23},4,"减益状态",null,4,"地",null,null,4,"橙色圣物数量"]
[6,"伤害减免",{"$nulls":3},5,"致盲",{"$nulls":24},5,"持续伤害",null,5,"光",null,null,5,"神秘药水使用次数"]
[7,"命中",{"$nulls":3},6,"免疫控制状态",{"$nulls":24},6,"负面状态",null,6,"暗"]
[8,"闪避",{"$nulls":3},7,"麻痹"]
[9,"暴击率"]
[10,"暴伤"]
[11,"治疗系数"]
[12,"最大生命"]
[13,"当前生命"]
[14,"受治疗系数"]
[15,"抗暴率"]
[16,"初始怒气"]
[]
[]
[]
{"$rows_left_out":33}
{"sheet":"Sheet1","index":3,"n_rows":104,"n_cols":12,"rows_kept":104}
[10001,"石御霏",{"$nulls":3},10001,1,1,"1000111",{"$f":"VLOOKUP(F1,$A:$B,2,0)","v":"石御霏"},"凌甲","对敌方单体造成灵魂力%的水属性物理伤害，\n对自身有%的概率(+效果命中)造成嘲讽，并提升护甲%，持续x秒。"]
[10002,"楚恒",{"$nulls":3},10002,1,1,"1000211",{"$f":"VLOOKUP(F2,$A:$B,2,0)","v":"楚恒"},"啸牙","对敌方单体造成灵魂力%的风属性物理伤害，\n对自身有%的概率(+效果命中)造成嘲讽，并提升灵魂力%，持续x秒。"]
[10003,"夏侯鸿天",{"$nulls":3},10003,1,1,"1000311",{"$f":"VLOOKUP(F3,$A:$B,2,0)","v":"夏侯鸿天"},"断鸿","对敌方单体造成灵魂力%的地属性物理伤害，\n将造成伤害的%转化为生命"]
[10004,"应茹",{"$nulls":3},10004,1,1,"1000411","应茹","轻流","对敌方单体造成灵魂力%的风属性魔法伤害，\n为当前生命最低的x名队友在x秒内，每秒恢复灵魂力%的生命"]
[10005,"端木葵",{"$nulls":3},10005,1,1,"1000511","端木葵","长槐琼灯","对敌方单体造成灵魂力%的地属性魔法伤害，\n恢复自身灵魂力%的生命，\n持续x秒灵魂力增加25%"]
[10006,"兰卿",{"$nulls":3},10006,1,1,"1000611","兰卿","阳炎破阵曲","对敌方全体造成灵魂力%的火属性魔法伤害，\n在x秒内，友方全体灵魂力增加%"]
[10007,"靖之",{"$nulls":3},10007,1,1,"1000711","靖之","破甲裂","对随机3名敌方造成灵魂力%的水属性物理伤害，\n造成伤害后，在x秒内降低目标%的护甲"]
[10008,"白梦凡",{"$nulls":3},10008,1,1,"1000811","白梦凡","幻境之瞳","对敌方单体造成灵魂力%的光属性魔法伤害，\n对生花类妖灵师造成额外%伤害。"]
[10009,"祁菲",{"$nulls":3},10009,1,1,"1000911","祁菲","黑符","对随机3名敌人造成灵魂力%的暗属性物理伤害，\n造成伤害时，在x秒内对敌人造成燃烧效果，\n燃烧效果持续期间，每秒造成灵魂力%的伤害。"]
[10010,"颜祈佳",{"$nulls":3},10010,1,1,"1001011","颜祈佳","涡流","对随机3名敌人造成灵魂力%的水属性魔法伤害，\n对武卫类妖灵师造成额外%伤害。"]
[10011,"叶延",{"$nulls":3},10011,1,1,"1001111","叶延","地灵咒","对随机2名敌人造成灵魂力%的地属性魔法伤害，\n造成伤害时，在x秒内对敌人造成中毒效果，\n中毒效果持续期间，每秒造成灵魂力%的伤害。"]
[10012,"慕容子期",{"$nulls":3},10012,1,1,"1001211","慕容子期","焚花","对敌方单体造成灵魂力%的火属性物理伤害，\n施展技能后，冷却时间增加x秒，\n造成伤害时，为敌人附加1层中毒效果，最多叠加x层。"]
[10013,"云灵",{"$nulls":3},10013,1,1,"1001311","云灵","黑泉利箭","对敌方单体造成灵魂力%的地属性物理伤害，\n在x秒内，暴击率增加%，\n在x秒内，暴击伤害增加%。"]
[10014,"耿陶",{"$nulls":3},10014,1,1,"1001411","耿陶","墨意","对敌方2名敌人造成灵魂力%的暗属性物理伤害，\n造成伤害时，有%的概率（+效果命中）降低其%护甲，\n造成伤害时，有%的概率（+效果命中）沉默x秒。"]
[10015,"云",{"$nulls":3},10015,1,1,"1001511","云","辉映","对敌方单体造成灵魂力%的光属性魔法伤害，\n将造成伤害的%转化为自身生命"]
[10016,"岑以航",{"$nulls":3},10016,1,1,"1001611","岑以航","无明火","对敌方单体造成灵魂力%的火属性魔法伤害，\n对异常状态的敌人造成伤害时，无视敌人38%抗性"]
[10017,"影蓟",{"$nulls":3},10017,1,1,"1001711",{"$f":"VLOOKUP(F17,$A:$B,2,0)","v":"影蓟"},"晦影","对随机2名敌人造成灵魂力%的暗属性魔法伤害，\n造成伤害时，有%的概率（+效果命中）在x秒内护甲降低%\n造成伤害时，有%的概率（+效果命中）沉默x秒"]
[10018,"朱贺",{"$nulls":3},10018,1,1,"1001811","朱贺","天照","对敌方单体造成灵魂力%的光属性魔法伤害，\n造成伤害时，在x秒内对敌人造成流血效果，\n流血效果持续期间，每秒造成灵魂力%的伤害。"]
[10019,"孔谦",{"$nulls":3},10019,1,1,"1001911","孔谦","辰变","对敌方单体造成灵魂力%的风属性物理伤害，\n施展技能后，在x秒内增加自身%灵魂力，%的暴击伤害。"]
[10020,"颜无雍",{"$nulls":3},10020,1,1,"1002011","颜无雍","天回","对随机3名敌人造成灵魂力%的火属性物理伤害，\n为随机恢复2名友方恢复灵魂力%的生命。"]
{"$rows_left_out":85}
{"sheet":"Sheet2","index":4,"n_rows":47,"n_cols":6,"rows_kept":47}
[]
[null,1000114,{"$f":"VLOOKUP($B2,SkillLogicConfig!$B:$F,2,FALSE)","v":"400001#0.4|200000#0.4"},{"$f":"VLOOKUP($B2,SkillLogicConfig!$B:$F,3,FALSE)","v":"1|3"},{"$f":"VLOOKUP($B2,SkillLogicConfig!$B:$F,4,FALSE)","v":"4.3#1|0.8#3#10"},{"$f":"VLOOKUP($B2,SkillLogicConfig!$B:$F,5,FALSE)","v":0}]
[null,1000124,{"$f":"VLOOKUP($B3,SkillLogicConfig!$B:$F,2,FALSE)","v":0},{"$f":"VLOOKUP($B3,SkillLogicConfig!$B:$F,3,FALSE)","v":0},{"$f":"VLOOKUP($B3,SkillLogicConfig!$B:$F,4,FALSE)","v":0},{"$f":"VLOOKUP($B3,SkillLogicConfig!$B:$F,5,FALSE)","v":0}]
[null,{"$f":"B2+100","v":1000214},{"$f":"VLOOKUP($B4,SkillLogicConfig!$B:$F,2,FALSE)","v":"220003#0.4|220003#0.4"},{"$f":"VLOOKUP($B4,SkillLogicConfig!$B:$F,3,FALSE)","v":"81|3"},{"$f":"VLOOKUP($B4,SkillLogicConfig!$B:$F,4,FALSE)","v":"4.3#1#1#2.7#5|0.6#3#10"},{"$f":"VLOOKUP($B4,SkillLogicConfig!$B:$F,5,FALSE)","v":0}]
[null,{"$f":"B3+100","v":1000224},{"$f":"VLOOKUP($B5,SkillLogicConfig!$B:$F,2,FALSE)","v":"400001#0.4|300001#0.4"},{"$f":"VLOOKUP($B5,SkillLogicConfig!$B:$F,3,FALSE)","v":"1|82#4"},{"$f":"VLOOKUP($B5,SkillLogicConfig!$B:$F,4,FALSE)","v":"5.8#1|0.5#6|6#0.4#6#1"},{"$f":"VLOOKUP($B5,SkillLogicConfig!$B:$F,5,FALSE)","v":45000}]
[null,1000314,{"$f":"VLOOKUP($B6,SkillLogicConfig!$B:$F,2,FALSE)","v":"400001#0.4|200000#0.4"},{"$f":"VLOOKUP($B6,SkillLogicConfig!$B:$F,3,FALSE)","v":"1|3"},{"$f":"VLOOKUP($B6,SkillLogicConfig!$B:$F,4,FALSE)","v":"4.3#1|0.6#3#10"},{"$f":"VLOOKUP($B6,SkillLogicConfig!$B:$F,5,FALSE)","v":0}]
[null,1000324,{"$f":"VLOOKUP($B7,SkillLogicConfig!$B:$F,2,FALSE)","v":0},{"$f":"VLOOKUP($B7,SkillLogicConfig!$B:$F,3,FALSE)","v":0},{"$f":"VLOOKUP($B7,SkillLogicConfig!$B:$F,4,FALSE)","v":0},{"$f":"VLOOKUP($B7,SkillLogicConfig!$B:$F,5,FALSE)","v":0}]
[null,1000414,{"$f":"VLOOKUP($B8,SkillLogicConfig!$B:$F,2,FALSE)","v":"400001#0.4|100211#0.4"},{"$f":"VLOOKUP($B8,SkillLogicConfig!$B:$F,3,FALSE)","v":"1|89#83"},{"$f":"VLOOKUP($B8,SkillLogicConfig!$B:$F,4,FALSE)","v":"4.8#2|1#1#3.6#6#2|1#1#4"},{"$f":"VLOOKUP($B8,SkillLogicConfig!$B:$F,5,FALSE)","v":0}]
[null,1000424,{"$f":"VLOOKUP($B9,SkillLogicConfig!$B:$F,2,FALSE)","v":"200000#0.4|100000#0.4"},{"$f":"VLOOKUP($B9,SkillLogicConfig!$B:$F,3,FALSE)","v":"2#4|24"},{"$f":"VLOOKUP($B9,SkillLogicConfig!$B:$F,4,FALSE)","v":"6#2|8#0.3#12#3|1#4.8"},{"$f":"VLOOKUP($B9,SkillLogicConfig!$B:$F,5,FALSE)","v":45000}]
[null,1000514,{"$f":"VLOOKUP($B10,SkillLogicConfig!$B:$F,2,FALSE)","v":"220003#0.4"},{"$f":"VLOOKUP($B10,SkillLogicConfig!$B:$F,3,FALSE)","v":20},{"$f":"VLOOKUP($B10,SkillLogicConfig!$B:$F,4,FALSE)","v":"2.4#2#1#2"},{"$f":"VLOOKUP($B10,SkillLogicConfig!$B:$F,5,FALSE)","v":0}]
[null,1000524,{"$f":"VLOOKUP($B11,SkillLogicConfig!$B:$F,2,FALSE)","v":"200000#0.4"},{"$f":"VLOOKUP($B11,SkillLogicConfig!$B:$F,3,FALSE)","v":20},{"$f":"VLOOKUP($B11,SkillLogicConfig!$B:$F,4,FALSE)","v":"3.6#2#1#2"},{"$f":"VLOOKUP($B11,SkillLogicConfig!$B:$F,5,FALSE)","v":45000}]
[null,1000614,{"$f":"VLOOKUP($B12,SkillLogicConfig!$B:$F,2,FALSE)","v":"400001#0.4"},{"$f":"VLOOKUP($B12,SkillLogicConfig!$B:$F,3,FALSE)","v":"91#1#25"},{"$f":"VLOOKUP($B12,SkillLogicConfig!$B:$F,4,FALSE)","v":"1#1#0.2#2#10#5|2.4#2|1#0.1#10"},{"$f":"VLOOKUP($B12,SkillLogicConfig!$B:$F,5,FALSE)","v":0}]
[null,1000624,{"$f":"VLOOKUP($B13,SkillLogicConfig!$B:$F,2,FALSE)","v":"200003#0.4"},{"$f":"VLOOKUP($B13,SkillLogicConfig!$B:$F,3,FALSE)","v":"91#1#25"},{"$f":"VLOOKUP($B13,SkillLogicConfig!$B:$F,4,FALSE)","v":"1#1#0.3#2#10#5|4#2|1#0.25#10"},{"$f":"VLOOKUP($B13,SkillLogicConfig!$B:$F,5,FALSE)","v":45000}]
[null,1000714,{"$f":"VLOOKUP($B14,SkillLogicConfig!$B:$F,2,FALSE)","v":"400001#0.4|300001#0.4"},{"$f":"VLOOKUP($B14,SkillLogicConfig!$B:$F,3,FALSE)","v":"1|9"},{"$f":"VLOOKUP($B14,SkillLogicConfig!$B:$F,4,FALSE)","v":"4.3#2|1#3#10#0"},{"$f":"VLOOKUP($B14,SkillLogicConfig!$B:$F,5,FALSE)","v":0}]
[null,1000724,{"$f":"VLOOKUP($B15,SkillLogicConfig!$B:$F,2,FALSE)","v":0},{"$f":"VLOOKUP($B15,SkillLogicConfig!$B:$F,3,FALSE)","v":0},{"$f":"VLOOKUP($B15,SkillLogicConfig!$B:$F,4,FALSE)","v":0},{"$f":"VLOOKUP($B15,SkillLogicConfig!$B:$F,5,FALSE)","v":0}]
[null,1000814,{"$f":"VLOOKUP($B16,SkillLogicConfig!$B:$F,2,FALSE)","v":"400001#0.4"},{"$f":"VLOOKUP($B16,SkillLogicConfig!$B:$F,3,FALSE)","v":1},{"$f":"VLOOKUP($B16,SkillLogicConfig!$B:$F,4,FALSE)","v":"4.3#1"},{"$f":"VLOOKUP($B16,SkillLogicConfig!$B:$F,5,FALSE)","v":0}]
[null,1000824,{"$f":"VLOOKUP($B17,SkillLogicConfig!$B:$F,2,FALSE)","v":0},{"$f":"VLOOKUP($B17,SkillLogicConfig!$B:$F,3,FALSE)","v":0},{"$f":"VLOOKUP($B17,SkillLogicConfig!$B:$F,4,FALSE)","v":0},{"$f":"VLOOKUP($B17,SkillLogicConfig!$B:$F,5,FALSE)","v":0}]
[null,1000914,{"$f":"VLOOKUP($B18,SkillLogicConfig!$B:$F,2,FALSE)","v":"220003#0.7"},{"$f":"VLOOKUP($B18,SkillLogicConfig!$B:$F,3,FALSE)","v":65},{"$f":"VLOOKUP($B18,SkillLogicConfig!$B:$F,4,FALSE)","v":"2.9#2#0#0#10"},{"$f":"VLOOKUP($B18,SkillLogicConfig!$B:$F,5,FALSE)","v":0}]
[null,1000924,{"$f":"VLOOKUP($B19,SkillLogicConfig!$B:$F,2,FALSE)","v":"220003#0.4"},{"$f":"VLOOKUP($B19,SkillLogicConfig!$B:$F,3,FALSE)","v":66},{"$f":"VLOOKUP($B19,SkillLogicConfig!$B:$F,4,FALSE)","v":"4.8#2#0#10#0.2"},{"$f":"VLOOKUP($B19,SkillLogicConfig!$B:$F,5,FALSE)","v":45000}]
[null,1001014,{"$f":"VLOOKUP($B20,SkillLogicConfig!$B:$F,2,FALSE)","v":"400001#0.4"},{"$f":"VLOOKUP($B20,SkillLogicConfig!$B:$F,3,FALSE)","v":71},{"$f":"VLOOKUP($B20,SkillLogicConfig!$B:$F,4,FALSE)","v":"2#2#2.3#1#0.20#1#3#1"},{"$f":"VLOOKUP($B20,SkillLogicConfig!$B:$F,5,FALSE)","v":0}]
{"$rows_left_out":28}
{"sheet":"Sheet3","index":5,"n_rows":101,"n_cols":6,"rows_kept":101}
[]
[null,null,50,"01","01","500101"]
[null,null,50,"01","02","500102"]
[null,null,50,"01","03","500103"]
[null,null,50,"01","04","500104"]
[null,null,50,"01","05","500105"]
[null,null,50,"01","06","500106"]
[null,null,50,"01","07","500107"]
[null,null,50,"01","08","500108"]
[null,null,50,"01","09","500109"]
[null,null,50,"01","10","500110"]
[null,null,50,"02","01","500201"]
[null,null,50,"02","02","500202"]
[null,null,50,"02","03","500203"]
[null,null,50,"02","04","500204"]
[null,null,50,"02","05","500205"]
[null,null,50,"02","06","500206"]
[null,null,50,"02","07","500207"]
[null,null,50,"02","08","500208"]
[null,null,50,"02","09","500209"]
{"$rows_left_out":82}
{"sheet":"结构解析规则","index":6,"n_rows":44,"n_cols":4,"rows_kept":44}
["技能数据结构","{cd, {目标id1, 效果时间, 效果1, 效果2, ...},{目标id2, 效果时间, 效果3, 效果4, ...}, ...}"]
["效果 = {效果类型id, 效果参数1, 效果参数2, ...}"]
[]
["Target","Effect","EffectValue","CD"]
["mut,float#float,2","mut,int#int,2","mut,float#float,2","float"]
["40001#0.7|30011#0.7","1|3#4#4","1.08#1|1#3#10|2#0.3#3#1|3#0.3#3#1",2]
[]
["json = { 2,{40001,0.7,{1,1.08,1}},{30011,0.7,{3,1,3,10},{4,2,0.3,3,1},{4,3,0.3,3,1}}}"]
["json = {"]
[null,"2,"]
[null,"{"]
[null,null,"40001,"]
[null,null,"0.7,"]
[null,null,"{"]
[{"$nulls":3},"1,"]
[{"$nulls":3},"1.08,"]
[{"$nulls":3},1]
[null,null,"}"]
[null,"},"]
[null,"{"]
{"$rows_left_out":25}
{"sheet":"怪物技能辅助表","index":7,"n_rows":296,"n_cols":19,"rows_kept":296}
[null,"Id","Target","Effect","EffectValue","CD",{"$nulls":3},"NoUse"]
[null,"int","mut,float#float,2","mut,int#int,2","mut,float#float,2","float",{"$nulls":3},"string"]
[null,2,2,2,2,2,{"$nulls":3},0]
[null,"技能id","目标选择","技能效果组合","技能效果参数","上滑技施法时间",{"$nulls":3},"备注"]
["默认值",0,"null","null","null",0]
["正确性校对"]
["校对值"]
[]
["怪物技能",{"$nulls":5},"辅助列",null,"c出手速度"]
[]
[{"$nulls":13},"伤害目标人数",null,"伤害系数1","伤害段数",null,"伤害系数2"]
[20001,20001,"20003#0.7","1","0.45#1",0,{"$f":"ROUNDUP((B12-20000)/3,0)","v":1},{"$f":"INDEX(#REF!,MATCH(I12,#REF!,0),1)","v":{"$error":"#REF!"}},3,{"$f":"REPLACE(E12,1,FIND(\"#\",E12,1)-1,S12)","v":"0.416#1"},1.248,null,null,{"$f":"IF(--LEFT(C12,1)=2,MID(C12,5,1),\"\")","v":"3"},{"$f":"IF(N12=\"\",K12,IF(N12=0,ROUND(K12/3,3),ROUND(K12/N12,3)))","v":0.416},{"$f":"IFERROR(O12,ROUND(K12/3,3))","v":0.416},{"$f":"FIND(\"6\",D12,1)","v":{"$error":"#VALUE!"}},{"$f":"IFERROR(IF(Q12=1,ROUNDUP((MID(E12,3,1)+MID(E12,1,1))/2,0),1),0)","v":0},{"$f":"IF(R12=0,P12,ROUND(P12/R12,3))","v":0.416}]
[20002,20002,"20003#0.7","1","0.45#1",0,{"$f":"ROUNDUP((B13-20000)/3,0)","v":1},{"$f":"INDEX(#REF!,MATCH(I13,#REF!,0),1)","v":{"$error":"#REF!"}},5,{"$f":"REPLACE(E13,1,FIND(\"#\",E13,1)-1,S13)","v":"0.693#1"},2.08,null,null,{"$f":"IF(--LEFT(C13,1)=2,MID(C13,5,1),\"\")","v":"3"},{"$f":"IF(N13=\"\",K13,IF(N13=0,ROUND(K13/3,3),ROUND(K13/N13,3)))","v":0.693},{"$f":"IFERROR(O13,ROUND(K13/3,3))","v":0.693},{"$f":"FIND(\"6\",D13,1)","v":{"$error":"#VALUE!"}},{"$f":"IFERROR(IF(Q13=1,ROUNDUP((MID(E13,3,1)+MID(E13,1,1))/2,0),1),0)","v":0},{"$f":"IF(R13=0,P13,ROUND(P13/R13,3))","v":0.693}]
[20003,20003,"20003#0.7","1","0.45#1",0,1,{"$f":"INDEX(#REF!,MATCH(I14,#REF!,0),1)","v":{"$error":"#REF!"}},7.9,"1.095#1",3.2864,null,null,"3",1.095,1.095,{"$error":"#VALUE!"},0,1.095]
[20004,20004,"40001#0.7","1","1.25#1",0,2,{"$f":"INDEX(#REF!,MATCH(I15,#REF!,0),1)","v":{"$error":"#REF!"}},{"$f":"I12","v":3},"1.248#1",1.248,null,null,"",1.248,1.248,{"$error":"#VALUE!"},0,1.248]
[20005,20005,"40001#0.7","1","1.25#1",0,2,{"$f":"INDEX(#REF!,MATCH(I16,#REF!,0),1)","v":{"$error":"#REF!"}},5,"2.08#1",2.08,null,null,"",2.08,2.08,{"$error":"#VALUE!"},0,2.08]
[20006,20006,"40001#0.7","1","1.25#1",0,2,{"$f":"INDEX(#REF!,MATCH(I17,#REF!,0),1)","v":{"$error":"#REF!"}},7.9,"3.2864#1",3.2864,null,null,"",3.2864,3.2864,{"$error":"#VALUE!"},0,3.2864]
[20007,20007,"40001#0.7","1#13","0.8#1|1#0.1#2#5",0,3,{"$f":"INDEX(#REF!,MATCH(I18,#REF!,0),1)","v":{"$error":"#REF!"}},3,"1.248#1|1#0.1#2#5",1.248,null,null,"",1.248,1.248,{"$error":"#VALUE!"},0,1.248]
[20008,20008,"40001#0.7","1#13","0.8#1|1#0.1#2#5",0,3,{"$f":"INDEX(#REF!,MATCH(I19,#REF!,0),1)","v":{"$error":"#REF!"}},5,"2.08#1|1#0.1#2#5",2.08,null,null,"",2.08,2.08,{"$error":"#VALUE!"},0,2.08]
[20009,20009,"40001#0.7","1#13","0.8#1|1#0.1#2#5",0,3,{"$f":"INDEX(#REF!,MATCH(I20,#REF!,0),1)","v":{"$error":"#REF!"}},7.9,"3.2864#1|1#0.1#2#5",3.2864,null,null,"",3.2864,3.2864,{"$error":"#VALUE!"},0,3.2864]
{"$rows_left_out":277}
{"sheet":"Sheet4","index":8,"n_rows":53,"n_cols":14,"rows_kept":53}
[null,null,"姓名","职业名字","属性","伤害类型","品质","点击技","上滑技","CD"]
[100012,10001,"石御霏","武卫","水","物理","★★★★★","对敌方单体造成（108%）物理伤害\n（100%）嘲讽，持续（10）秒，提升双防（30%），持续（6）秒。","对敌方随机2人造成（205%）物理伤害\n（60%）概率眩晕其中1人，持续（5）秒。",5,null,null,10001,"夏侯鸿天"]
[100022,10002,"楚恒","武卫","风","物理","★★★★★","对敌方单体造成（135%）物理伤害\n（80%）嘲讽，持续（10）秒，提升自身攻击（20%），持续（6）秒。","对敌方随机2人造成（166%）物理伤害\n给自身添加最大生命（60%）的伤害吸收盾，持续（6）秒，盾消失的时候对随机1人反射吸收盾吸收的45%物理伤害。",5,null,null,10002,"石御霏"]
[100032,10003,"夏侯鸿天","武卫","地","物理","★★★★★","对敌方单体造成（85%）物理伤害\n自身恢复造成伤害的（65%）的生命。","对敌方单体造成（90%）物理伤害，并削弱其魔抗（45%），持续（5）秒\n（100%）嘲讽，持续（10）秒。",5,null,null,10003,"叶辽"]
[100042,10004,"应茹","生花","风","魔法","★★★★★","对敌方单体造成（120%）魔法伤害\n为当前生命最低的（1）名队友持续恢复生命（攻击*80%），持续（4）秒","对敌方全体造成（105%）魔法伤害\n为全体队友持续恢复（攻击*88%）生命，持续（3）秒",2,null,null,10004,"孔谦"]
[100052,10005,"端木葵","生花","地","魔法","★★★★★","对敌方单体造成（85%）魔法伤害，恢复自身（攻击*98%）生命，并提升自己（30%）攻击，持续（4）秒","对敌方随机4人造成（120%）魔法伤害，为全体队友恢复（攻击*98%）生命",2,null,null,10005,"兰卿"]
[100062,10006,"兰卿","生花","火","魔法","★★★★★","对敌方全体造成（96%）魔法伤害\n增加我方全体攻击攻击（30%），持续（5）秒","对敌方全体造成（130%）魔法伤害\n降低其攻击（15%），持续（6）秒",2,null,null,10006,"朱贺"]
[100072,10007,"靖之","生花","水","物理","★★★★★","对敌方1名敌人造成3段（108%）物理伤害\n并降低其防御（30%），持续（10）秒","对敌方单体造成（150%）物理伤害\n清除CD最长的1名友军的CD，（立刻变成可释放技能状态）",2,null,null,10007,"应茹"]
[100082,10008,"白梦凡","秘法","光","魔法","★★★★★","对敌方单体造成4段伤害（60%）魔法伤害，\n对生花造成额外（50%）伤害。","对敌方全体造成（85%）魔法伤害\n（30%）晕眩敌方，持续（4）秒",4,null,null,10008,"颜无雍"]
[100092,10009,"祁菲","秘法","暗","物理","★★★★★","对敌方随机1人造成3段（86%）物理伤害\n并造成燃烧效果，每秒造成（35%）攻击的物理伤害，持续（5）秒。","对敌方全体造成（105%）物理伤害\n对燃烧效果的敌人造成额外伤害25%\n同时自身获得一层减伤50%护盾，护盾期间60%免疫控制，持续6秒。",4,null,null,10009,"祁菲"]
[100102,10010,"颜祈佳","秘法","水","魔法","★★★★★","对敌方1人造成2段（88%）魔法伤害，\n对武卫造成额外（50%）伤害。","对敌方全体造成（96%）魔法伤害\n并（70%）增加随机1人重击CD+2秒",4,null,null,10010,"颜祈佳"]
[100112,10011,"叶延","秘法","地","魔法","★★★★★","对敌方1人造成2段（70%）魔法伤害\n并造成中毒效果，每秒造成（25%）攻击的伤害，持续（3）秒","对敌方全体造成（90%）魔法伤害\n对中毒目标造成（66%）晕眩效果，持续（3）秒",4,null,null,10011,"尹正霄"]
[100122,10012,"慕容子期","天罚","火","物理","★★★★★","增加重击CD 1秒，对单体造成（116%）物理伤害\n同时给对方加一层中毒效果，每秒造成（20%）伤害，持续（5）秒。","对当前血量最低的2个人，造成（86%）物理伤害\n同时使对方（5）秒无法恢复血量。",3,null,null,10012,"慕容子期"]
[100132,10013,"云灵","天罚","地","物理","★★★★★","对敌方单体造成（100%）物理伤害\n同时给自身添加（10%）的暴击率，（10%）的暴击伤害，持续（5）秒。","对敌方攻击力最高的2名角色造成（135%）的物理伤害\n有（60%）的概率追加一次伤害，最多可追加（4）次。",3,null,null,10013,"白梦凡"]
[100142,10014,"耿陶","天罚","暗","物理","★★★★★","对敌方敌人造成（120%）物理伤害，\n对秘法目标必定暴击","对敌方随机1人造成3-5次（205%）物理伤害\n提升自身50%暴击伤害。",3,null,null,10014,"颜无诡"]
[100152,10015,"云","天罚","光","魔法","★★★★★","对敌方1名敌人造成（135%）魔法伤害，\n将造成伤害的（45%）转化为自己生命","对敌方随机2人造成（160）魔法伤害\n并偷取对方（6%）攻击，持续（15）秒\n同时给敌方添加暴击印记，带有印记的目标，额外受到30%的暴击伤害（最高累计300%）",3,null,null,10015,"凝儿"]
[100162,10016,"岑以航","玄策","火","魔法","★★★★★","对敌方单体造成（95%）魔法伤害\n对控制状态的敌人额外造成无视敌人（38%）防御的攻击","\n对随机3人造成（150%）魔法伤害，对带有持续恢复状态的敌人额外造成（30%）的魔法伤害\n自身降低（20%）的魔抗，提高（30%）的攻击，持续（6）秒",3,null,null,10016,"枫元正"]
[100172,10017,"影蓟","玄策","暗","魔法","★★★★★","对敌方1名敌人造成2段（123%）魔法伤害\n降低其（40%）护甲，同时（60%）概率沉默（5）秒。","对敌方随机4人造成（167%）魔法伤害\n对沉默敌人额外造成（50%）伤害。",3,null,null,10017,"解幽"]
[100182,10018,"朱贺","玄策","光","魔法","★★★★★","对敌方1名敌人造成（187%）魔法伤害。","对敌方生命最低的1人造成（300%）魔法伤害\n偷取（18%）攻击，同时造成流血效果，每秒造成（45%）的伤害，持续（4）。",3,null,null,10018,"紫苏"]
[100192,10019,"孔谦","玄策","风","物理","★★★★★","对敌方单体造成（105%）物理伤害\n增加自身（10%）攻击，（20%）暴击伤害，持续（3）秒。","对敌方全体造成（120%）的物理伤害\n减少全体重击CD（1）秒，持续（3）秒。",3,null,null,10019,"云"]
{"$rows_left_out":34}
{"sheet":"爬塔怪物技能设计","index":9,"n_rows":50,"n_cols":10,"rows_kept":50}
[null,"目标","效果","具体效果","特点"]
[null,"20001#0.7|10111#0.7","1#24","单体伤害+单体治疗","单体、治疗",null,null,"20000#0.7|10000#0.7","2|24","群体伤害+群体治疗"]
[null,"20001#0.7|10111#0.7","1#5","单体伤害+单体hot","单体、治疗",null,null,"20001#0.7|10111#0.7","1|24","单体伤害+单体治疗"]
[null,"20000#0.7|10000#0.7","2#24","群体伤害+群体治疗","群体、治疗",null,null,"20000#0.7|10000#0.7","2|5#4","群体伤害+群体hot"]
[null,"20000#0.7|10000#0.7","2#5","群体伤害+群体hot","群体、治疗",null,null,"20000#0.7|10000#0.7","2#4|5","群体伤害+群体hot"]
[null,"20001#0.7","1#3","单体伤害+单体控","单体、控制",null,null,"20000#0.7","2#3","群体伤害+群体控"]
[null,"20000#0.7","2#3","群体伤害+群体控","群体、控制",null,null,"20001#0.7",20,"单体+对控制额外伤害"]
[null,"20000#0.7|20003#0.7","2|3","群体伤害+几人控","群体、控制",null,null,"20000#0.7",35,"群体+被控额外受伤"]
[null,"20001#0.7",20,"单体+对控制额外伤害","单体、控制",null,null,"20001#0.7","1#3","单体伤害+单体控"]
[null,"20000#0.7",20,"群体+对控制额外伤害","群体、控制",null,null,"20001#0.7",20,"单体+对控制额外伤害"]
[null,"20001#0.7",30,"单体+对控制额外真伤","单体、控制"]
[null,"20000#0.7",30,"群体+对控制额外真伤","群体、控制"]
[null,"20001#0.7",35,"单体+被控额外受伤","单体、控制"]
[null,"20000#0.7",35,"群体+被控额外受伤","群体、控制"]
[null,"20001#0.7","1#13","单体+dot","单体、dot",null,null,"20001#0.7","1#13","单体+dot"]
[null,"20000#0.7","2#13","群体+dot","群体、dot",null,null,"20000#0.7",22,"群体+dot额外伤害"]
[null,"20000#0.7",21,"群体+dot控制","群体、dot",null,null,"20000#0.7",35,"群体+dot额外受伤"]
[null,"20000#0.7",22,"群体+dot额外伤害","群体、dot",null,null,"20000#0.7",21,"群体+dot控制"]
[null,"20001#0.7",35,"单体+dot额外受伤","单体、dot"]
[null,"20000#0.7",35,"群体+dot额外受伤","群体、dot"]
{"$rows_left_out":30}