{"text_format":"3","workbook":"xlsx","n_sheets":3,"sheets":["TrialGameConfig","boss及奖励分配表","mappoint辅助表"],"not_rendered":{"comments":1},"read":"whole","date_system":"1900"}

{"sheet":"TrialGameConfig","index":0,"n_rows":63,"n_cols":8,"rows_kept":63}
[null,"Id","Type","RewardID","Weight","Min","Max","UnlockLv"]
[null,"int","int","int","int","int","int","int"]
[null,2,2,2,2,2,2,2]
[null,"ID","类型\n16福星\n17转盘\n18挖矿","奖励道具id","权重","奖励数量下限","奖励数量上限","奖励入库等级"]
["默认值",0,0,null,null,"null",0,1]
["正确性校对"]
["校对值"]
[null,1,16,3,100,20000,23000,55]
[null,2,16,3,100,23000,26000,65]
[null,3,16,3,100,26000,29000,75]
[null,4,16,3,100,29000,32000,85]
[null,5,16,3,100,32000,35000,95]
[null,6,16,3,100,35000,38000,105]
[null,7,16,3,100,38000,41000,115]
[null,8,16,3,100,41000,44000,125]
[null,9,16,3,100,44000,47000,135]
[null,10,16,3,100,47000,50000,145]
[null,11,16,3,100,20000,23000,55]
[null,12,16,3,100,23000,26000,65]
[null,13,16,3,100,26000,29000,75]
{"$rows_left_out":44}
{"sheet":"boss及奖励分配表","index":1,"n_rows":202,"n_cols":73,"rows_kept":202}
[{"$nulls":4},11,16,14,100,100000,120000,55]
[{"$nulls":4},12,16,14,100,120000,140000,65,{"$nulls":7},"天数","关卡","层数","天数","战斗概率","其他事件","具体天数","boss个数",{"$nulls":10},"天数","层数","累计层数","扫荡层数","金币获取","累计获取","铁矿石获取","累计获取","钻石获取","钻石累计获取","突破石获取","累计获取",{"$nulls":4},"层数","金币","累计","铁矿石","累计","钻石","概率","实际钻石","累计","突破石","概率","实际获取","累计"]
[{"$nulls":4},13,16,14,100,140000,160000,75,{"$nulls":7},1,{"$f":"VLOOKUP(V3,#REF!,3,TRUE)","v":{"$error":"#REF!"}},1,1,0.8,0.2,0.5,3,10023,{"$f":"VLOOKUP(AA3,$AG:$AH,2,FALSE)","v":"荧荧"},10021,"清然",10005,"兰卿",{"$nulls":4},1,{"$f":"COUNTIFS(V:V,AK3)","v":12},{"$f":"AL3","v":12},{"$f":"_xlfn.FLOOR.MATH(AM3,5)","v":10},{"$f":"VLOOKUP(AN3,$BA:$BC,3,0)","v":9500},{"$f":"SUM($AO$3:AO3)","v":9500},{"$f":"VLOOKUP(AN3,$BA:$BE,5,0)","v":525},{"$f":"SUM($AQ$3:AQ3)","v":525},{"$f":"VLOOKUP(AN3,$BA:$BI,9,0)","v":5.999999999999999},{"$f":"SUM($AS$3:AS3)","v":5.999999999999999},{"$f":"VLOOKUP(AN3,$BA:$BM,13)","v":20},{"$f":"SUM($AU$3:AU3)","v":20},{"$nulls":4},1,500,{"$f":"SUM($BB$3:BB3)","v":500},30,{"$f":"SUM($BD$3:BD3)","v":30},5,0.12,{"$f":"BF3*BG3","v":0.6},{"$f":"SUM($BH$3:BH3)","v":0.6},10,0.2,{"$f":"BJ3*BK3","v":2},{"$f":"SUM($BL$3:BL3)","v":2},null,null,"荧荧",10023,"岑以璇",10021,"端木葵",10005]
[{"$nulls":4},14,16,14,100,160000,180000,85,{"$nulls":7},1,{"$f":"VLOOKUP(V4,#REF!,3,TRUE)","v":{"$error":"#REF!"}},2,1,0.8,0.2,0.6,2,10018,{"$f":"VLOOKUP(AA4,$AG:$AH,2,FALSE)","v":"紫苏"},10001,{"$f":"VLOOKUP(AC4,$AG:$AH,2,FALSE)","v":"夏侯鸿天"},{"$error":"#N/A"},{"$f":"VLOOKUP(AE4,$AG:$AH,2,FALSE)","v":{"$error":"#N/A"}},{"$nulls":4},2,8,{"$f":"SUM($AL$3:AL4)","v":20},20,{"$f":"VLOOKUP(AN4,$BA:$BC,3,0)","v":29000},{"$f":"SUM($AO$3:AO4)","v":38500},{"$f":"VLOOKUP(AN4,$BA:$BE,5,0)","v":1550},{"$f":"SUM($AQ$3:AQ4)","v":2075},{"$f":"VLOOKUP(AN4,$BA:$BI,9,0)","v":11.999999999999996},{"$f":"SUM($AS$3:AS4)","v":17.999999999999996},{"$f":"VLOOKUP(AN4,$BA:$BM,13)","v":40},{"$f":"SUM($AU$3:AU4)","v":60},{"$nulls":4},2,600,{"$f":"SUM($BB$3:BB4)","v":1100},35,{"$f":"SUM($BD$3:BD4)","v":65},5,0.12,{"$f":"BF4*BG4","v":0.6},{"$f":"SUM($BH$3:BH4)","v":1.2},10,0.2,{"$f":"BJ4*BK4","v":2},{"$f":"SUM($BL$3:BL4)","v":4},null,null,"朱贺",10018,"石御霏",10001,"",{"$error":"#N/A"}]
[{"$nulls":4},15,16,14,100,180000,200000,95,{"$nulls":7},1,{"$f":"VLOOKUP(V5,#REF!,3,TRUE)","v":{"$error":"#REF!"}},3,1,0.8,0.2,0.7,3,10002,"石御霏",10005,"兰卿",10018,"紫苏",{"$nulls":4},3,6,{"$f":"SUM($AL$3:AL5)","v":26},25,42500,{"$f":"SUM($AO$3:AO5)","v":81000},2250,{"$f":"SUM($AQ$3:AQ5)","v":4325},14.999999999999995,{"$f":"SUM($AS$3:AS5)","v":32.99999999999999},50,{"$f":"SUM($AU$3:AU5)","v":110},{"$nulls":4},3,700,{"$f":"SUM($BB$3:BB5)","v":1800},40,{"$f":"SUM($BD$3:BD5)","v":105},5,0.12,0.6,{"$f":"SUM($BH$3:BH5)","v":1.7999999999999998},10,0.2,2,{"$f":"SUM($BL$3:BL5)","v":6},null,null,"楚恒",10002,"端木葵",10005,"朱贺",10018]
[{"$nulls":4},16,16,14,100,200000,220000,105,{"$nulls":7},1,{"$f":"VLOOKUP(V6,#REF!,3,TRUE)","v":{"$error":"#REF!"}},4,1,0.8,0.2,0.8,3,10017,"解幽",10009,"祁菲",10016,"枫元正","id","角色名","id",null,4,4,{"$f":"SUM($AL$3:AL6)","v":30},30,58500,{"$f":"SUM($AO$3:AO6)","v":139500},3075,{"$f":"SUM($AQ$3:AQ6)","v":7400},18,{"$f":"SUM($AS$3:AS6)","v":50.99999999999999},60,{"$f":"SUM($AU$3:AU6)","v":170},{"$nulls":4},4,800,{"$f":"SUM($BB$3:BB6)","v":2600},45,{"$f":"SUM($BD$3:BD6)","v":150},5,0.12,0.6,{"$f":"SUM($BH$3:BH6)","v":2.4},10,0.2,2,{"$f":"SUM($BL$3:BL6)","v":8},null,null,"影蓟",10017,"祁菲",10009,"岑以航",10016]
[null,null,"扫荡奖励主要",null,17,16,14,100,220000,240000,115,{"$nulls":7},1,{"$f":"VLOOKUP(V7,#REF!,3,TRUE)","v":{"$error":"#REF!"}},5,1,1,0,0.8,2,10012,{"$f":"VLOOKUP(AA7,$AG:$AH,2,FALSE)","v":"慕容子期"},{"$error":"#N/A"},{"$f":"VLOOKUP(AC7,$AG:$AH,2,FALSE)","v":{"$error":"#N/A"}},{"$error":"#N/A"},{"$error":"#N/A"},10001,"夏侯鸿天",10001,"嘲讽+双抗+眩晕",5,4,{"$f":"SUM($AL$3:AL7)","v":34},30,58500,{"$f":"SUM($AO$3:AO7)","v":198000},3075,{"$f":"SUM($AQ$3:AQ7)","v":10475},18,{"$f":"SUM($AS$3:AS7)","v":69},60,{"$f":"SUM($AU$3:AU7)","v":230},{"$nulls":4},5,900,{"$f":"SUM($BB$3:BB7)","v":3500},50,{"$f":"SUM($BD$3:BD7)","v":200},5,0.12,0.6,{"$f":"SUM($BH$3:BH7)","v":3},10,0.2,2,{"$f":"SUM($BL$3:BL7)","v":10},null,null,"朱贺",10018,"石御霏",10001,"",{"$error":"#N/A"}]
[{"$nulls":3},"金币",18,16,14,100,240000,260000,125,{"$nulls":7},1,{"$f":"VLOOKUP(V8,#REF!,3,TRUE)","v":{"$error":"#REF!"}},6,1,0.8,0.2,0.9,2,10014,"颜无诡",10012,"慕容子期",{"$error":"#N/A"},{"$error":"#N/A"},10002,"石御霏",10002,"嘲讽+攻击+伤害吸收盾",6,4,{"$f":"SUM($AL$3:AL8)","v":38},35,77000,{"$f":"SUM($AO$3:AO8)","v":275000},4025,{"$f":"SUM($AQ$3:AQ8)","v":14500},21.000000000000007,{"$f":"SUM($AS$3:AS8)","v":90},70,{"$f":"SUM($AU$3:AU8)","v":300},{"$nulls":3}," ",6,1000,{"$f":"SUM($BB$3:BB8)","v":4500},55,{"$f":"SUM($BD$3:BD8)","v":255},5,0.12,0.6,{"$f":"SUM($BH$3:BH8)","v":3.6},10,0.2,2,{"$f":"SUM($BL$3:BL8)","v":12},null,null,"耿陶",10014,"慕容子期",10012,"",{"$error":"#N/A"}]
[{"$nulls":3},"铁矿石",19,16,14,100,260000,280000,135,{"$nulls":7},1,{"$f":"VLOOKUP(V9,#REF!,3,TRUE)","v":{"$error":"#REF!"}},7,1,0.8,0.2,0.9,3,10020,"司空染",10016,"枫元正",10007,"应茹",10003,"叶辽",10003,"伤害转化生命+嘲讽+削弱魔抗",7,2,{"$f":"SUM($AL$3:AL9)","v":40},40,98000,{"$f":"SUM($AO$3:AO9)","v":373000},5100,{"$f":"SUM($AQ$3:AQ9)","v":19600},24.000000000000014,{"$f":"SUM($AS$3:AS9)","v":114.00000000000001},80,{"$f":"SUM($AU$3:AU9)","v":380},{"$nulls":4},7,1100,{"$f":"SUM($BB$3:BB9)","v":5600},60,{"$f":"SUM($BD$3:BD9)","v":315},5,0.12,0.6,{"$f":"SUM($BH$3:BH9)","v":4.2},10,0.2,2,{"$f":"SUM($BL$3:BL9)","v":14},null,null,"颜无雍",10020,"岑以航",10016,"靖之",10007]
[{"$nulls":4},20,16,14,100,280000,300000,145,{"$nulls":7},1,{"$f":"VLOOKUP(V10,#REF!,3,TRUE)","v":{"$error":"#REF!"}},8,1,0.8,0.2,0.9,3,10015,"凝儿",10010,"颜祈佳",10010,"颜祈佳",10004,"孔谦",10004,"单体治疗+全体治疗",8,2,{"$f":"SUM($AL$3:AL10)","v":42},40,98000,{"$f":"SUM($AO$3:AO10)","v":471000},5100,{"$f":"SUM($AQ$3:AQ10)","v":24700},24.000000000000014,{"$f":"SUM($AS$3:AS10)","v":138.00000000000003},80,{"$f":"SUM($AU$3:AU10)","v":460},{"$nulls":4},8,1200,{"$f":"SUM($BB$3:BB10)","v":6800},65,{"$f":"SUM($BD$3:BD10)","v":380},5,0.12,0.6,{"$f":"SUM($BH$3:BH10)","v":4.8},10,0.2,2,{"$f":"SUM($BL$3:BL10)","v":16},null,null,"云",10015,"颜祈佳",10010,"颜祈佳",10010]
[null,null,"随机部分",{"$nulls":15},1,{"$f":"VLOOKUP(V11,#REF!,3,TRUE)","v":{"$error":"#REF!"}},9,1,0.8,0.2,0.9,1,10006,{"$f":"VLOOKUP(AA11,$AG:$AH,2,FALSE)","v":"朱贺"},10017,{"$f":"VLOOKUP(AC11,$AG:$AH,2,FALSE)","v":"解幽"},{"$error":"#N/A"},{"$error":"#N/A"},10005,"兰卿",10005,"自身治疗+提攻+全体治疗",9,2,{"$f":"SUM($AL$3:AL11)","v":44},40,98000,{"$f":"SUM($AO$3:AO11)","v":569000},5100,{"$f":"SUM($AQ$3:AQ11)","v":29800},24.000000000000014,{"$f":"SUM($AS$3:AS11)","v":162.00000000000006},80,{"$f":"SUM($AU$3:AU11)","v":540},{"$nulls":4},9,1300,{"$f":"SUM($BB$3:BB11)","v":8100},70,{"$f":"SUM($BD$3:BD11)","v":450},5,0.12,0.6,{"$f":"SUM($BH$3:BH11)","v":5.3999999999999995},10,0.2,2,{"$f":"SUM($BL$3:BL11)","v":18},null,null,"慕容子期",10012,"",{"$error":"#N/A"},"",{"$error":"#N/A"}]
[{"$nulls":3},"天堂铸造石",{"$nulls":14},1,{"$f":"VLOOKUP(V12,#REF!,3,TRUE)","v":{"$error":"#REF!"}},10,1,1,0,1,2,10015,"凝儿",10012,"慕容子期",10011,"尹正霄",10006,"朱贺",10006,"提全体攻+降全体攻",10,1,{"$f":"SUM($AL$3:AL12)","v":45},45,121500,{"$f":"SUM($AO$3:AO12)","v":690500},6300,{"$f":"SUM($AQ$3:AQ12)","v":36100},27.00000000000002,{"$f":"SUM($AS$3:AS12)","v":189.00000000000009},90,{"$f":"SUM($AU$3:AU12)","v":630},{"$nulls":4},10,1400,{"$f":"SUM($BB$3:BB12)","v":9500},75,{"$f":"SUM($BD$3:BD12)","v":525},5,0.12,0.6,{"$f":"SUM($BH$3:BH12)","v":5.999999999999999},10,0.2,2,{"$f":"SUM($BL$3:BL12)","v":20},null,null,"白梦凡",10008,"颜无雍",10020,"",{"$error":"#N/A"}]
[{"$nulls":3},"金币",{"$nulls":14},1,{"$f":"VLOOKUP(V13,#REF!,3,TRUE)","v":{"$error":"#REF!"}},11,1,0.8,0.2,1.2,3,10018,"紫苏",10021,"清然",10005,"兰卿",10007,"应茹",10007,"降单体防御+清CD",11,1,{"$f":"SUM($AL$3:AL13)","v":46},45,121500,{"$f":"SUM($AO$3:AO13)","v":812000},6300,{"$f":"SUM($AQ$3:AQ13)","v":42400},27.00000000000002,{"$f":"SUM($AS$3:AS13)","v":216.0000000000001},90,{"$f":"SUM($AU$3:AU13)","v":720},{"$nulls":4},11,1500,{"$f":"SUM($BB$3:BB13)","v":11000},80,{"$f":"SUM($BD$3:BD13)","v":605},5,0.12,0.6,{"$f":"SUM($BH$3:BH13)","v":6.599999999999999},10,0.2,2,{"$f":"SUM($BL$3:BL13)","v":22},null,null,"朱贺",10018,"岑以璇",10021,"端木葵",10005]
[{"$nulls":3},"突破石",{"$nulls":14},1,{"$f":"VLOOKUP(V14,#REF!,3,TRUE)","v":{"$error":"#REF!"}},12,1,0.8,0.2,1.4,1,10022,"云灵",{"$error":"#N/A"},{"$error":"#N/A"},{"$error":"#N/A"},{"$error":"#N/A"},10008,"颜无雍",10008,"生花伤害+眩晕",12,1,{"$f":"SUM($AL$3:AL14)","v":47},45,121500,{"$f":"SUM($AO$3:AO14)","v":933500},6300,{"$f":"SUM($AQ$3:AQ14)","v":48700},27.00000000000002,{"$f":"SUM($AS$3:AS14)","v":243.00000000000014},90,{"$f":"SUM($AU$3:AU14)","v":810},{"$nulls":4},12,1600,{"$f":"SUM($BB$3:BB14)","v":12600},85,{"$f":"SUM($BD$3:BD14)","v":690},5,0.12,0.6,{"$f":"SUM($BH$3:BH14)","v":7.199999999999998},10,0.2,2,{"$f":"SUM($BL$3:BL14)","v":24},null,null,"颜无诡",10022,"",{"$error":"#N/A"},"",{"$error":"#N/A"}]
[{"$nulls":18},2,{"$f":"VLOOKUP(V15,#REF!,3,TRUE)","v":{"$error":"#REF!"}},13,2,0.8,0.2,1.5,1,10003,"叶辽",{"$error":"#N/A"},{"$error":"#N/A"},{"$error":"#N/A"},{"$error":"#N/A"},10009,"祁菲",10009,"燃烧+燃烧加伤+减伤盾",13,1,{"$f":"SUM($AL$3:AL15)","v":48},45,121500,{"$f":"SUM($AO$3:AO15)","v":1055000},6300,{"$f":"SUM($AQ$3:AQ15)","v":55000},27.00000000000002,{"$f":"SUM($AS$3:AS15)","v":270.00000000000017},90,{"$f":"SUM($AU$3:AU15)","v":900},{"$nulls":4},13,1700,{"$f":"SUM($BB$3:BB15)","v":14300},90,{"$f":"SUM($BD$3:BD15)","v":780},5,0.12,0.6,{"$f":"SUM($BH$3:BH15)","v":7.799999999999998},10,0.2,2,{"$f":"SUM($BL$3:BL15)","v":26},null,null,"夏侯鸿天",10003,"",{"$error":"#N/A"},"",{"$error":"#N/A"}]
[{"$nulls":18},2,{"$f":"VLOOKUP(V16,#REF!,3,TRUE)","v":{"$error":"#REF!"}},14,2,0.8,0.2,1.6,2,10002,"石御霏",10005,"兰卿",{"$error":"#N/A"},{"$error":"#N/A"},10010,"颜祈佳",10010,"武卫伤害+加CD",14,1,{"$f":"SUM($AL$3:AL16)","v":49},45,121500,{"$f":"SUM($AO$3:AO16)","v":1176500},6300,{"$f":"SUM($AQ$3:AQ16)","v":61300},27.00000000000002,{"$f":"SUM($AS$3:AS16)","v":297.00000000000017},90,{"$f":"SUM($AU$3:AU16)","v":990},{"$nulls":4},14,1800,{"$f":"SUM($BB$3:BB16)","v":16100},95,{"$f":"SUM($BD$3:BD16)","v":875},5,0.12,0.6,{"$f":"SUM($BH$3:BH16)","v":8.399999999999999},10,0.2,2,{"$f":"SUM($BL$3:BL16)","v":28},null,null,"应茹",10004,"颜无雍",10020,"",{"$error":"#N/A"}]
[null,null,"buff",null,50,null,100,null,180,{"$nulls":9},2,{"$f":"VLOOKUP(V17,#REF!,3,TRUE)","v":{"$error":"#REF!"}},15,2,1,0,1.7,3,10002,"石御霏",10008,"颜无雍",10016,"枫元正",10011,"尹正霄",10011,"中毒+中毒晕眩",15,1,{"$f":"SUM($AL$3:AL17)","v":50},50,147500,{"$f":"SUM($AO$3:AO17)","v":1324000},7625,{"$f":"SUM($AQ$3:AQ17)","v":68925},30.00000000000003,{"$f":"SUM($AS$3:AS17)","v":327.0000000000002},100,{"$f":"SUM($AU$3:AU17)","v":1090},{"$nulls":4},15,1900,{"$f":"SUM($BB$3:BB17)","v":18000},100,{"$f":"SUM($BD$3:BD17)","v":975},5,0.12,0.6,{"$f":"SUM($BH$3:BH17)","v":8.999999999999998},10,0.2,2,{"$f":"SUM($BL$3:BL17)","v":30},null,null,"端木葵",10005,"叶延",10011,"慕容子期",10012]
[{"$nulls":3},"恢复药剂","全队生命恢复20%",null,"全队生命恢复50%",null,"全队生命恢复100%",{"$nulls":9},2,{"$f":"VLOOKUP(V18,#REF!,3,TRUE)","v":{"$error":"#REF!"}},16,2,0.8,0.2,1.8,3,10022,"云灵",10015,"凝儿",10012,"慕容子期",10012,"慕容子期",10012,"中毒+禁疗",16,0,{"$f":"SUM($AL$3:AL18)","v":50},50,147500,{"$f":"SUM($AO$3:AO18)","v":1471500},7625,{"$f":"SUM($AQ$3:AQ18)","v":76550},30.00000000000003,{"$f":"SUM($AS$3:AS18)","v":357.0000000000002},100,{"$f":"SUM($AU$3:AU18)","v":1190},{"$nulls":4},16,2000,{"$f":"SUM($BB$3:BB18)","v":20000},105,{"$f":"SUM($BD$3:BD18)","v":1080},5,0.12,0.6,{"$f":"SUM($BH$3:BH18)","v":9.599999999999998},10,0.2,2,{"$f":"SUM($BL$3:BL18)","v":32},null,null,"颜无诡",10022,"云",10015,"慕容子期",10012]
[{"$nulls":3},"buff药剂","攻击3%",null,"攻击6%",null,"攻击15%",{"$nulls":9},2,{"$f":"VLOOKUP(V19,#REF!,3,TRUE)","v":{"$error":"#REF!"}},17,2,0.8,0.2,1.9,2,10009,"祁菲",10010,"颜祈佳",{"$error":"#N/A"},{"$error":"#N/A"},10013,"白梦凡",10013,"暴击+暴伤+追加伤害",17,1,{"$f":"SUM($AL$3:AL19)","v":51},50,147500,{"$f":"SUM($AO$3:AO19)","v":1619000},7625,{"$f":"SUM($AQ$3:AQ19)","v":84175},30.00000000000003,{"$f":"SUM($AS$3:AS19)","v":387.0000000000002},100,{"$f":"SUM($AU$3:AU19)","v":1290},{"$nulls":4},17,2100,{"$f":"SUM($BB$3:BB19)","v":22100},110,{"$f":"SUM($BD$3:BD19)","v":1190},5,0.12,0.6,{"$f":"SUM($BH$3:BH19)","v":10.199999999999998},10,0.2,2,{"$f":"SUM($BL$3:BL19)","v":34},null,null,"祁菲",10009,"颜祈佳",10010,"",{"$error":"#N/A"}]
[{"$nulls":4},"暴击3%",null,"暴击6%",null,"暴击15%",{"$nulls":9},2,{"$f":"VLOOKUP(V20,#REF!,3,TRUE)","v":{"$error":"#REF!"}},18,2,0.8,0.2,2,3,10018,"紫苏",10019,"云",10006,"朱贺",10014,"颜无诡",10014,"击杀清CD+提攻+提效果命中",18,0,{"$f":"SUM($AL$3:AL20)","v":51},50,147500,{"$f":"SUM($AO$3:AO20)","v":1766500},7625,{"$f":"SUM($AQ$3:AQ20)","v":91800},30.00000000000003,{"$f":"SUM($AS$3:AS20)","v":417.0000000000002},100,{"$f":"SUM($AU$3:AU20)","v":1390},{"$nulls":4},18,2200,{"$f":"SUM($BB$3:BB20)","v":24300},115,{"$f":"SUM($BD$3:BD20)","v":1305},5,0.12,0.6,{"$f":"SUM($BH$3:BH20)","v":10.799999999999997},10,0.2,2,{"$f":"SUM($BL$3:BL20)","v":36},null,null,"朱贺",10018,"应茹",10004,"兰卿",10006]
{"$rows_left_out":183}
{"sheet":"mappoint辅助表","index":2,"n_rows":207,"n_cols":29,"rows_kept":207}
[{"$nulls":4},"RandomMonsterType",null,null,"MonsterCount","RandomBossType",null,"RandomMapPointId"]
[{"$nulls":4},"mut,int#int,2",null,null,"mut,int#int,1","mut,int#int,2",null,"mut,int#int,3"]
[{"$nulls":4},2,null,null,4,4,null,4]
[1,2,3,4,"类型#怪物MapPointid\n1普通\n2精英",null,null,"怪物数量","类型#权重\n1boss\n2福利怪\n3补给点\n4商店",null,"对应MapPointid",10000,null,null,0.2,null,null,0.1]
[{"$nulls":4},"null",null,null,"1#1","null",null,"null",{"$nulls":3},0.07,null,null,0.03]
[{"$nulls":14},0.07,0.07,{"$f":"ROUND(P6/4*10000,0)","v":175},0.04,{"$f":"R6/4*10000","v":100}]
[{"$nulls":14},0.06,null,null,0.03,"其他事件","战斗概率",{"$nulls":3},"怪物组MapPoint","扫荡奖励"]
[{"$nulls":4},{"$f":"$A$4&\"#\"&F8&\"|\"&$B$4&\"#\"&G8","v":"1#2001001|2#2001002"},2001001,2001002,"5#3","1#8000|2#700|3#700|4#600",null,{"$f":"IF(S8=0,L8&\"#\"&$L$4&\",\"&M8&\"#\"&$L$4&\",\"&N8&\"#\"&$L$4&\",\"&R8,L8&\"#\"&T8*100&\",\"&M8&\"#\"&$L$4&\",\"&N8&\"#\"&$L$4&\",\"&R8)","v":"2001003#80,2001004#10000,2001005#10000,2001009"},2001003,2001004,2001005,2001006,{"$f":"O8+1","v":2001007},{"$f":"P8+1","v":2001008},{"$f":"Q8+1","v":2001009},0.2,0.8,{"$f":"IF(S8=0,L8&\"#\"&$L$4,\"\")","v":""},{"$f":"O8&\"#\"&$Q$6&\"|\"&P8&\"#\"&$Q$6&\"|\"&Q8&\"#\"&$Q$6&\"|\"&R8&\"#\"&$Q$6","v":"2001006#175|2001007#175|2001008#175|2001009#175"},{"$f":"IF(S8=0,\"\",L8&\"#\"&T8*10000&\",\"&M8&\"#\"&70&\",\"&V8&\",\"&N8&\"#\"&60)","v":"2001003#8000,2001004#70,2001006#175|2001007#175|2001008#175|2001009#175,2001005#60"},{"$f":"_xlfn.TEXTJOIN(\"\",TRUE,U8,W8)","v":"2001003#8000,2001004#70,2001006#175|2001007#175|2001008#175|2001009#175,2001005#60"},{"$f":"_xlfn.TEXTJOIN(\"#\",TRUE,Z8:AC8)","v":"60001#41#42#61000"},60001,41,42,61000]
[{"$nulls":4},{"$f":"$A$4&\"#\"&F9&\"|\"&$B$4&\"#\"&G9","v":"1#2002001|2#2002002"},{"$f":"F8+1000","v":2002001},2002002,"5#3","1#8000|2#700|3#700|4#600",null,{"$f":"L9&\"#\"&$L$4&\",\"&M9&\"#\"&$L$4&\",\"&N9&\"#\"&$L$4&\",\"&R9&\"#\"&$L$4","v":"2002003#10000,2002004#10000,2002005#10000,2001009#10000"},{"$f":"L8+1000","v":2002003},2002004,2002005,{"$f":"O8","v":2001006},{"$f":"P8","v":2001007},{"$f":"Q8","v":2001008},{"$f":"R8","v":2001009},0.2,0.8,{"$f":"IF(S9=0,L9&\"#\"&$L$4,\"\")","v":""},{"$f":"O9&\"#\"&$Q$6&\"|\"&P9&\"#\"&$Q$6&\"|\"&Q9&\"#\"&$Q$6&\"|\"&R9&\"#\"&$Q$6","v":"2001006#175|2001007#175|2001008#175|2001009#175"},{"$f":"IF(S9=0,\"\",L9&\"#\"&T9*10000&\",\"&M9&\"#\"&70&\",\"&V9&\",\"&N9&\"#\"&60)","v":"2002003#8000,2002004#70,2001006#175|2001007#175|2001008#175|2001009#175,2002005#60"},{"$f":"_xlfn.TEXTJOIN(\"\",TRUE,U9,W9)","v":"2002003#8000,2002004#70,2001006#175|2001007#175|2001008#175|2001009#175,2002005#60"},{"$f":"_xlfn.TEXTJOIN(\"#\",TRUE,Z9:AC9)","v":"60002#41#42#61000"},{"$f":"Z8+1","v":60002},{"$f":"AA8","v":41},{"$f":"AB8","v":42},{"$f":"AC8","v":61000}]
[{"$nulls":4},{"$f":"$A$4&\"#\"&F10&\"|\"&$B$4&\"#\"&G10","v":"1#2003001|2#2003002"},2003001,2003002,"5#3","1#8000|2#700|3#700|4#600",null,{"$f":"L10&\"#\"&$L$4&\",\"&M10&\"#\"&$L$4&\",\"&N10&\"#\"&$L$4&\",\"&R10&\"#\"&$L$4","v":"2003003#10000,2003004#10000,2003005#10000,2001009#10000"},2003003,2003004,2003005,{"$f":"O9","v":2001006},{"$f":"P9","v":2001007},{"$f":"Q9","v":2001008},{"$f":"R9","v":2001009},0.2,0.8,"","2001006#175|2001007#175|2001008#175|2001009#175","2003003#8000,2003004#70,2001006#175|2001007#175|2001008#175|2001009#175,2003005#60","2003003#8000,2003004#70,2001006#175|2001007#175|2001008#175|2001009#175,2003005#60",{"$f":"_xlfn.TEXTJOIN(\"#\",TRUE,Z10:AC10)","v":"60003#41#42#61000"},{"$f":"Z9+1","v":60003},{"$f":"AA9","v":41},{"$f":"AB9","v":42},{"$f":"AC9","v":61000}]
[{"$nulls":4},{"$f":"$A$4&\"#\"&F11&\"|\"&$B$4&\"#\"&G11","v":"1#2004001|2#2004002"},2004001,2004002,"5#3","1#8000|2#700|3#700|4#600",null,{"$f":"L11&\"#\"&$L$4&\",\"&M11&\"#\"&$L$4&\",\"&N11&\"#\"&$L$4&\",\"&R11&\"#\"&$L$4","v":"2004003#10000,2004004#10000,2004005#10000,2001009#10000"},2004003,2004004,2004005,2001006,2001007,2001008,2001009,0.2,0.8,"","2001006#175|2001007#175|2001008#175|2001009#175","2004003#8000,2004004#70,2001006#175|2001007#175|2001008#175|2001009#175,2004005#60","2004003#8000,2004004#70,2001006#175|2001007#175|2001008#175|2001009#175,2004005#60","60004#41#42#61000",60004,41,42,61000]
[{"$nulls":4},{"$f":"$A$4&\"#\"&F12&\"|\"&$B$4&\"#\"&G12","v":"1#2005001|2#2005002"},2005001,2005002,"5#3","1#10000",null,{"$f":"L12&\"#\"&$L$4&\",\"&M12&\"#\"&$L$4&\",\"&N12&\"#\"&$L$4&\",\"&R12&\"#\"&$L$4","v":"2005003#10000,2005004#10000,2005005#10000,2001009#10000"},2005003,2005004,2005005,2001006,2001007,2001008,2001009,0,1,"2005003#10000","2001006#175|2001007#175|2001008#175|2001009#175","","2005003#10000","60005#41#42#61000",60005,41,42,61000]
[{"$nulls":4},{"$f":"$A$4&\"#\"&F13&\"|\"&$B$4&\"#\"&G13","v":"1#2006001|2#2006002"},{"$f":"F12+1000","v":2006001},{"$f":"G12+1000","v":2006002},"5#3",{"$f":"I8","v":"1#8000|2#700|3#700|4#600"},null,{"$f":"L13&\"#\"&$L$4&\",\"&M13&\"#\"&$L$4&\",\"&N13&\"#\"&$L$4&\",\"&R13&\"#\"&$L$4","v":"2006003#10000,2006004#10000,2006005#10000,2001009#10000"},{"$f":"L12+1000","v":2006003},{"$f":"M12+1000","v":2006004},{"$f":"N12+1000","v":2006005},2001006,2001007,2001008,2001009,0.2,0.8,"","2001006#175|2001007#175|2001008#175|2001009#175","2006003#8000,2006004#70,2001006#175|2001007#175|2001008#175|2001009#175,2006005#60","2006003#8000,2006004#70,2001006#175|2001007#175|2001008#175|2001009#175,2006005#60","60006#41#42#61000",60006,41,42,61000]
[{"$nulls":4},"1#2007001|2#2007002",2007001,2007002,"5#3",{"$f":"I9","v":"1#8000|2#700|3#700|4#600"},null,"2007003#10000,2007004#10000,2007005#10000,2001009#10000",2007003,2007004,2007005,2001006,2001007,2001008,2001009,0.2,0.8,"","2001006#175|2001007#175|2001008#175|2001009#175","2007003#8000,2007004#70,2001006#175|2001007#175|2001008#175|2001009#175,2007005#60","2007003#8000,2007004#70,2001006#175|2001007#175|2001008#175|2001009#175,2007005#60","60007#41#42#61000",60007,41,42,61000]
[{"$nulls":4},"1#2008001|2#2008002",2008001,2008002,"5#3","1#8000|2#700|3#700|4#600",null,"2008003#10000,2008004#10000,2008005#10000,2001009#10000",2008003,2008004,2008005,2001006,2001007,2001008,2001009,0.2,0.8,"","2001006#175|2001007#175|2001008#175|2001009#175","2008003#8000,2008004#70,2001006#175|2001007#175|2001008#175|2001009#175,2008005#60","2008003#8000,2008004#70,2001006#175|2001007#175|2001008#175|2001009#175,2008005#60","60008#41#42#61000",60008,41,42,61000]
[{"$nulls":4},"1#2009001|2#2009002",2009001,2009002,"5#3","1#8000|2#700|3#700|4#600",null,"2009003#10000,2009004#10000,2009005#10000,2001009#10000",2009003,2009004,2009005,2001006,2001007,2001008,2001009,0.2,0.8,"","2001006#175|2001007#175|2001008#175|2001009#175","2009003#8000,2009004#70,2001006#175|2001007#175|2001008#175|2001009#175,2009005#60","2009003#8000,2009004#70,2001006#175|2001007#175|2001008#175|2001009#175,2009005#60","60009#41#42#61000",60009,41,42,61000]
[{"$nulls":4},"1#2010001|2#2010002",2010001,2010002,"5#3","1#10000",null,"2010003#10000,2010004#10000,2010005#10000,2001009#10000",2010003,2010004,2010005,2001006,2001007,2001008,2001009,0,1,"2010003#10000","2001006#175|2001007#175|2001008#175|2001009#175","","2010003#10000","60010#41#42#61000",60010,41,42,61000]
[{"$nulls":4},"1#2011001|2#2011002",2011001,2011002,"5#3","1#8000|2#700|3#700|4#600",null,"2011003#10000,2011004#10000,2011005#10000,2001009#10000",2011003,2011004,2011005,2001006,2001007,2001008,2001009,0.2,0.8,"","2001006#175|2001007#175|2001008#175|2001009#175","2011003#8000,2011004#70,2001006#175|2001007#175|2001008#175|2001009#175,2011005#60","2011003#8000,2011004#70,2001006#175|2001007#175|2001008#175|2001009#175,2011005#60","60011#41#42#61000",60011,41,42,61000]
[{"$nulls":4},"1#2012001|2#2012002",2012001,2012002,"5#3","1#8000|2#700|3#700|4#600",null,"2012003#10000,2012004#10000,2012005#10000,2001009#10000",2012003,2012004,2012005,2001006,2001007,2001008,2001009,0.2,0.8,"","2001006#175|2001007#175|2001008#175|2001009#175","2012003#8000,2012004#70,2001006#175|2001007#175|2001008#175|2001009#175,2012005#60","2012003#8000,2012004#70,2001006#175|2001007#175|2001008#175|2001009#175,2012005#60","60012#41#42#61000",60012,41,42,61000]
[{"$nulls":4},"1#2013001|2#2013002",2013001,2013002,"5#3","1#8000|2#700|3#700|4#600",null,"2013003#10000,2013004#10000,2013005#10000,2001009#10000",2013003,2013004,2013005,2001006,2001007,2001008,2001009,0.2,0.8,"","2001006#175|2001007#175|2001008#175|2001009#175","2013003#8000,2013004#70,2001006#175|2001007#175|2001008#175|2001009#175,2013005#60","2013003#8000,2013004#70,2001006#175|2001007#175|2001008#175|2001009#175,2013005#60","60013#41#42#61000",60013,41,42,61000]
{"$rows_left_out":187}