{"text_format":"3","workbook":"xlsx","n_sheets":9,"sheets":["SkillConfig","Sheet7","Sheet6","Sheet5","Sheet2","Sheet1","Sheet4","y异妖技能","Sheet3"],"not_rendered":{"external_links":2,"defined_names":3,"comments":1},"read":"whole","date_system":"1900"}

{"sheet":"SkillConfig","index":0,"n_rows":913,"n_cols":11,"rows_kept":913}
[null,"Id","Name","Type","ShortDesc","Desc","DescValue","DescColor","Icon","NoUse","NoUse"]
[null,"int","string","int","string","string","mut,string#string,1","mut,int#int,1","int","boolean","boolean"]
[null,2,3,2,3,3,3,3,3,0,0]
[null,"技能id","技能名称","技能类型","短描述","技能描述","描述参数","参数颜色","技能图标\n关联资源表","校验","校验"]
["默认值",0,"",null,null,"",null,null,0]
["正确性校对"]
["校对值"]
[null,100001,"悲鸣",1,"弱者就该被淘汰！","对随机一名敌人造成伤害，附加流血效果。",null,null,238011]
[null,100002,"鬼蝉",2,"死吧！","对随机三名敌人造成伤害。",null,null,224021]
[null,1000111,"寒冰刺",1,"冰寒刺骨！","挥舞双斧，对对位敌人造成%s水属性物理伤害，%s概率%s敌方全体，持续%s秒。","220%#80%#嘲讽#10","2#0#1#0",203011,{"$f":"IF((LEN(F10)-LEN(SUBSTITUTE(F10,\"%\",\"\")))=(LEN(G10)-LEN(SUBSTITUTE(G10,\"#\",\"\")))+1,\"\",FALSE)","v":""},{"$f":"IF((LEN(G10)-LEN(SUBSTITUTE(G10,\"#\",\"\")))=(LEN(H10)-LEN(SUBSTITUTE(H10,\"#\",\"\"))),\"\",FALSE)","v":""}]
[null,"1000112","寒冰刺",1,"冰寒刺骨！","挥舞双斧，对对位敌人造成%s水属性物理伤害，%s概率%s敌方全体，持续%s秒。","250%#80%#嘲讽#10","2#0#1#0",203011,{"$f":"IF((LEN(F11)-LEN(SUBSTITUTE(F11,\"%\",\"\")))=(LEN(G11)-LEN(SUBSTITUTE(G11,\"#\",\"\")))+1,\"\",FALSE)","v":""},{"$f":"IF((LEN(G11)-LEN(SUBSTITUTE(G11,\"#\",\"\")))=(LEN(H11)-LEN(SUBSTITUTE(H11,\"#\",\"\"))),\"\",FALSE)","v":""}]
[null,"1000113","寒冰刺",1,"冰寒刺骨！","挥舞双斧，对对位敌人造成%s水属性物理伤害，%s概率%s敌方全体，持续%s秒。","360%#80%#嘲讽#10","2#0#1#0",203011,"",""]
[null,"1000114","寒冰刺",1,"冰寒刺骨！","挥舞双斧，对对位敌人造成%s水属性物理伤害，%s概率%s敌方全体，持续%s秒。","430%#80%#嘲讽#10","2#0#1#0",203011,"",""]
[null,"1000115","寒冰刺",1,"冰寒刺骨！","挥舞双斧，对对位敌人造成%s水属性物理伤害，%s概率%s敌方全体，持续%s秒。","540%#80%#嘲讽#10","2#0#1#0",203011,"",""]
[null,"1000121","裂山贯云",2,{"$nulls":4},203021,false,""]
[null,"1000122","裂山贯云",2,{"$nulls":4},203021,false,""]
[null,"1000123","裂山贯云",2,{"$nulls":4},203021,false,""]
[null,"1000124","裂山贯云",2,{"$nulls":4},203021,false,""]
[null,"1000125","裂山贯云",2,{"$nulls":4},203021,false,""]
[null,"1000211","拽刀",1,"不要放松警惕！","斩出一道刀罡，对对位及相邻敌人造成%s风属性物理伤害，同时%s概率%s目标，持续%s秒。为自身施加%s印记，持续%s秒，期间受到控制效果回复自身攻击%s的生命值。","220%#60%#嘲讽#10#甘霖#5#140%","2#1#0#0#0#1#0",201011,"",""]
{"$rows_left_out":894}
{"sheet":"Sheet7","index":1,"n_rows":32,"n_cols":9,"rows_kept":32}
[1,"倩女幽魂",{"$f":"B1","v":"倩女幽魂"},null,null,"倩女幽魂",100572,null,{"$f":"IF(F1<>\"\",F1,H1)","v":"倩女幽魂"}]
[1,{"$nulls":5},100581,"九头",{"$f":"IF(F2<>\"\",F2,H2)","v":"九头"}]
[2,"水毒火灼",{"$nulls":3},"水毒火灼",100582,"九婴火",{"$f":"IF(F3<>\"\",F3,H3)","v":"水毒火灼"}]
[2,{"$nulls":5},100591,"灵击","灵击"]
[3,"怨灵嘶吼",{"$nulls":3},"怨灵嘶吼",100592,"怨灵怒","怨灵嘶吼"]
[3,{"$nulls":5},100601,"追魂","追魂"]
[4,"悼亡哀花",{"$nulls":3},"悼亡哀花",100602,"悼亡花","悼亡哀花"]
[4,{"$nulls":5},100611,"大悲","大悲"]
[5,"秽土清居",{"$nulls":3},"秽土清居",100612,"秽土居","秽土清居"]
[5,{"$nulls":5},100621,"驱蛇","驱蛇"]
[6,"羽箭急流",{"$nulls":3},"羽箭急流",100622,"羽箭流","羽箭急流"]
[6,{"$nulls":5},100631,"御龙","御龙"]
[7,"逐恶除魔",{"$nulls":3},"逐恶除魔",100632,"净恶断","逐恶除魔"]
[7,{"$nulls":5},100641,"非天","非天"]
[8,"修罗一闪",{"$nulls":3},"修罗一闪",100642,"修罗斩","修罗一闪"]
[8,{"$nulls":5},100651,"重击","重击"]
[9,"除魔卫道",{"$nulls":3},"除魔卫道",100652,"破邪斩","除魔卫道"]
[9,{"$nulls":5},100661,"连弩","连弩"]
[10,"连环箭雨",{"$nulls":3},"连环箭雨",100662,"连环箭","连环箭雨"]
[10,{"$nulls":5},100671,"化蝶","化蝶"]
{"$rows_left_out":13}
{"sheet":"Sheet6","index":2,"n_rows":32,"n_cols":9,"rows_kept":32}
[null,100571,"大悲",1,null,"对敌方单体造成%s物理伤害","95%","2",245011]
[null,100572,"秽土居",2,null,"对敌方前排造成%s物理伤害，自身回复%s点怒气","163%#1","2#0",245021]
[null,100581,"龙斩",1,null,"对敌方单体造成%s物理伤害","95%","2",245011]
[null,100582,"泾龙斩",2,null,"对敌方纵排造成%s物理伤害","232%","2",245021]
[null,100591,"殇水",1,null,"对敌方前排造成%s物理伤害","47%","2",245011]
[null,100592,"水波击",2,null,"对敌方随机%s人造成%s物理伤害","3#163%","0#2",245021]
[null,100601,"流击",1,null,"对敌方单体造成%s法术伤害","95%","2",245011]
[null,100602,"渊流破",2,null,"对敌方单体造成%s法术伤害，技能伤害的%s转化为治疗，治疗己方生命最少的队友","333%#10%","2#0",245021]
[null,100611,"重击",1,null,"对敌方单体造成%s物理伤害","90%","2",245011]
[null,100612,"破邪斩",2,null,"对敌方单体造成%s物理伤害","315%","2",245021]
[null,100621,"云流",1,null,"对敌方单体造成%s物理伤害","90%","2",245011]
[null,100622,"云化龙",2,null,"对敌方纵排造成%s物理伤害有%s概率%s目标持续%s回合","212%#30%#眩晕#1","2#0#1#0",245021]
[null,100631,"盾击",1,null,"对敌方纵排造成%s物理伤害","60%","2",245011]
[null,100632,"遁龙桩",2,null,"对敌方纵排造成%s物理伤害并增加自身%s伤害持续%s回合可叠加","212%#5%#7","2#0#0",245021]
[null,100641,"速击",1,null,"对敌方单体造成%s物理伤害","90%","2",245011]
[null,100642,"穿云箭",2,null,"对敌方单体造成%s物理伤害并回复自身%s点怒气","315%#1","2#0",245021]
[null,100651,"九头",1,null,"对敌方单体造成%s物理伤害","90%","2",245011]
[null,100652,"九婴火",2,null,"对敌方单体造成%s物理伤害有%s概率%s目标，每回合造成自身攻击力%s的灼烧伤害持续%s回合","315%#60%#灼烧#20%#2","2#0#1#0#0",245021]
[null,100661,"连弩",1,null,"对敌方单体造成%s物理伤害","90%","2",245011]
[null,100662,"蝶踪箭",2,null,"对敌方单体造成%s物理伤害","315%","2",245021]
{"$rows_left_out":13}
{"sheet":"Sheet5","index":3,"n_rows":104,"n_cols":6,"rows_kept":104}
[null,1,null,1,"雷棍",{"$f":"C1&E1","v":"雷棍"}]
[null,2,"风卷雷涌",1,null,{"$f":"C2&E2","v":"风卷雷涌"}]
[null,1,null,2,"石落","石落"]
[null,2,"精卫填海",2,null,"精卫填海"]
[null,1,null,3,"流觞","流觞"]
[null,2,"洛水横断",3,null,"洛水横断"]
[null,1,null,4,"水怒","水怒"]
[null,2,"暗流狂涌",4,null,"暗流狂涌"]
[null,1,null,5,"广寒","广寒"]
[null,2,"月兔之助",5,null,"月兔之助"]
[null,1,null,6,"耙击","耙击"]
[null,2,"天蓬余威",6,null,"天蓬余威"]
[null,1,null,7,"墨痕","墨痕"]
[null,2,"文曲降世",7,null,"文曲降世"]
[null,1,null,8,"兵戎","兵戎"]
[null,2,"五行连斩",8,null,"五行连斩"]
[null,1,null,9,"乱刀","乱刀"]
[null,2,"混世邪斩",9,null,"混世邪斩"]
[null,1,null,10,"狂风","狂风"]
[null,2,"三昧神风",10,null,"三昧神风"]
{"$rows_left_out":85}
{"sheet":"Sheet2","index":4,"n_rows":2,"n_cols":2,"rows_kept":2}
["红色","[b4595e][-]"]
["绿色","[4c805e][-]"]

{"sheet":"Sheet1","index":5,"n_rows":104,"n_cols":12,"rows_kept":104}
[10001,"石御霏",{"$nulls":3},10001,1,1,"1000111",{"$f":"VLOOKUP(F1,$A:$B,2,0)","v":"石御霏"},{"$f":"VLOOKUP(J1,[2]特效需求!$A$5:$F$5664,6,0)","v":"凌甲"},{"$f":"VLOOKUP(J1,[2]特效需求!A$5:G$56,7,FALSE)","v":"对敌方单体造成灵魂力%的水属性物理伤害，\n对自身有%的概率(+效果命中)造成嘲讽，并提升护甲%，持续x秒。"}]
[10002,"楚恒",{"$nulls":3},10002,1,1,"1000211",{"$f":"VLOOKUP(F2,$A:$B,2,0)","v":"楚恒"},{"$f":"VLOOKUP(J2,[2]特效需求!$A$5:$F$5664,6,0)","v":"啸牙"},{"$f":"VLOOKUP(J2,[2]特效需求!A$5:G$56,7,FALSE)","v":"对敌方单体造成灵魂力%的风属性物理伤害，\n对自身有%的概率(+效果命中)造成嘲讽，并提升灵魂力%，持续x秒。"}]
[10003,"夏侯鸿天",{"$nulls":3},10003,1,1,"1000311",{"$f":"VLOOKUP(F3,$A:$B,2,0)","v":"夏侯鸿天"},{"$f":"VLOOKUP(J3,[2]特效需求!$A$5:$F$5664,6,0)","v":"断鸿"},{"$f":"VLOOKUP(J3,[2]特效需求!A$5:G$56,7,FALSE)","v":"对敌方单体造成灵魂力%的地属性物理伤害，\n将造成伤害的%转化为生命"}]
[10004,"应茹",{"$nulls":3},10004,1,1,"1000411","应茹",{"$f":"VLOOKUP(J4,[2]特效需求!$A$5:$F$5664,6,0)","v":"轻流"},{"$f":"VLOOKUP(J4,[2]特效需求!A$5:G$56,7,FALSE)","v":"对敌方单体造成灵魂力%的风属性魔法伤害，\n为当前生命最低的x名队友在x秒内，每秒恢复灵魂力%的生命"}]
[10005,"端木葵",{"$nulls":3},10005,1,1,"1000511","端木葵",{"$f":"VLOOKUP(J5,[2]特效需求!$A$5:$F$5664,6,0)","v":"长槐琼灯"},{"$f":"VLOOKUP(J5,[2]特效需求!A$5:G$56,7,FALSE)","v":"对敌方单体造成灵魂力%的地属性魔法伤害，\n恢复自身灵魂力%的生命，\n持续x秒灵魂力增加25%"}]
[10006,"兰卿",{"$nulls":3},10006,1,1,"1000611","兰卿",{"$f":"VLOOKUP(J6,[2]特效需求!$A$5:$F$5664,6,0)","v":"阳炎破阵曲"},{"$f":"VLOOKUP(J6,[2]特效需求!A$5:G$56,7,FALSE)","v":"对敌方全体造成灵魂力%的火属性魔法伤害，\n在x秒内，友方全体灵魂力增加%"}]
[10007,"靖之",{"$nulls":3},10007,1,1,"1000711","靖之",{"$f":"VLOOKUP(J7,[2]特效需求!$A$5:$F$5664,6,0)","v":"破甲裂"},{"$f":"VLOOKUP(J7,[2]特效需求!A$5:G$56,7,FALSE)","v":"对随机3名敌方造成灵魂力%的水属性物理伤害，\n造成伤害后，在x秒内降低目标%的护甲"}]
[10008,"白梦凡",{"$nulls":3},10008,1,1,"1000811","白梦凡",{"$f":"VLOOKUP(J8,[2]特效需求!$A$5:$F$5664,6,0)","v":"幻境之瞳"},{"$f":"VLOOKUP(J8,[2]特效需求!A$5:G$56,7,FALSE)","v":"对敌方单体造成灵魂力%的光属性魔法伤害，\n对生花类妖灵师造成额外%伤害。"}]
[10009,"祁菲",{"$nulls":3},10009,1,1,"1000911","祁菲",{"$f":"VLOOKUP(J9,[2]特效需求!$A$5:$F$5664,6,0)","v":"黑符"},{"$f":"VLOOKUP(J9,[2]特效需求!A$5:G$56,7,FALSE)","v":"对随机3名敌人造成灵魂力%的暗属性物理伤害，\n造成伤害时，在x秒内对敌人造成燃烧效果，\n燃烧效果持续期间，每秒造成灵魂力%的伤害。"}]
[10010,"颜祈佳",{"$nulls":3},10010,1,1,"1001011","颜祈佳",{"$f":"VLOOKUP(J10,[2]特效需求!$A$5:$F$5664,6,0)","v":"涡流"},{"$f":"VLOOKUP(J10,[2]特效需求!A$5:G$56,7,FALSE)","v":"对随机3名敌人造成灵魂力%的水属性魔法伤害，\n对武卫类妖灵师造成额外%伤害。"}]
[10011,"叶延",{"$nulls":3},10011,1,1,"1001111","叶延",{"$f":"VLOOKUP(J11,[2]特效需求!$A$5:$F$5664,6,0)","v":"地灵咒"},{"$f":"VLOOKUP(J11,[2]特效需求!A$5:G$56,7,FALSE)","v":"对随机2名敌人造成灵魂力%的地属性魔法伤害，\n造成伤害时，在x秒内对敌人造成中毒效果，\n中毒效果持续期间，每秒造成灵魂力%的伤害。"}]
[10012,"慕容子期",{"$nulls":3},10012,1,1,"1001211","慕容子期",{"$f":"VLOOKUP(J12,[2]特效需求!$A$5:$F$5664,6,0)","v":"焚花"},{"$f":"VLOOKUP(J12,[2]特效需求!A$5:G$56,7,FALSE)","v":"对敌方单体造成灵魂力%的火属性物理伤害，\n施展技能后，冷却时间增加x秒，\n造成伤害时，为敌人附加1层中毒效果，最多叠加x层。"}]
[10013,"云灵",{"$nulls":3},10013,1,1,"1001311","云灵",{"$f":"VLOOKUP(J13,[2]特效需求!$A$5:$F$5664,6,0)","v":"黑泉利箭"},{"$f":"VLOOKUP(J13,[2]特效需求!A$5:G$56,7,FALSE)","v":"对敌方单体造成灵魂力%的地属性物理伤害，\n在x秒内，暴击率增加%，\n在x秒内，暴击伤害增加%。"}]
[10014,"耿陶",{"$nulls":3},10014,1,1,"1001411","耿陶",{"$f":"VLOOKUP(J14,[2]特效需求!$A$5:$F$5664,6,0)","v":"墨意"},{"$f":"VLOOKUP(J14,[2]特效需求!A$5:G$56,7,FALSE)","v":"对敌方2名敌人造成灵魂力%的暗属性物理伤害，\n造成伤害时，有%的概率（+效果命中）降低其%护甲，\n造成伤害时，有%的概率（+效果命中）沉默x秒。"}]
[10015,"云",{"$nulls":3},10015,1,1,"1001511","云",{"$f":"VLOOKUP(J15,[2]特效需求!$A$5:$F$5664,6,0)","v":"辉映"},{"$f":"VLOOKUP(J15,[2]特效需求!A$5:G$56,7,FALSE)","v":"对敌方单体造成灵魂力%的光属性魔法伤害，\n将造成伤害的%转化为自身生命"}]
[10016,"岑以航",{"$nulls":3},10016,1,1,"1001611","岑以航",{"$f":"VLOOKUP(J16,[2]特效需求!$A$5:$F$5664,6,0)","v":"无明火"},{"$f":"VLOOKUP(J16,[2]特效需求!A$5:G$56,7,FALSE)","v":"对敌方单体造成灵魂力%的火属性魔法伤害，\n对异常状态的敌人造成伤害时，无视敌人38%抗性"}]
[10017,"影蓟",{"$nulls":3},10017,1,1,"1001711",{"$f":"VLOOKUP(F17,$A:$B,2,0)","v":"影蓟"},{"$f":"VLOOKUP(J17,[2]特效需求!$A$5:$F$5664,6,0)","v":"晦影"},{"$f":"VLOOKUP(J17,[2]特效需求!A$5:G$56,7,FALSE)","v":"对随机2名敌人造成灵魂力%的暗属性魔法伤害，\n造成伤害时，有%的概率（+效果命中）在x秒内护甲降低%\n造成伤害时，有%的概率（+效果命中）沉默x秒"}]
[10018,"朱贺",{"$nulls":3},10018,1,1,"1001811","朱贺",{"$f":"VLOOKUP(J18,[2]特效需求!$A$5:$F$5664,6,0)","v":"天照"},{"$f":"VLOOKUP(J18,[2]特效需求!A$5:G$56,7,FALSE)","v":"对敌方单体造成灵魂力%的光属性魔法伤害，\n造成伤害时，在x秒内对敌人造成流血效果，\n流血效果持续期间，每秒造成灵魂力%的伤害。"}]
[10019,"孔谦",{"$nulls":3},10019,1,1,"1001911","孔谦",{"$f":"VLOOKUP(J19,[2]特效需求!$A$5:$F$5664,6,0)","v":"辰变"},{"$f":"VLOOKUP(J19,[2]特效需求!A$5:G$56,7,FALSE)","v":"对敌方单体造成灵魂力%的风属性物理伤害，\n施展技能后，在x秒内增加自身%灵魂力，%的暴击伤害。"}]
[10020,"颜无雍",{"$nulls":3},10020,1,1,"1002011","颜无雍",{"$f":"VLOOKUP(J20,[2]特效需求!$A$5:$F$5664,6,0)","v":"天回"},{"$f":"VLOOKUP(J20,[2]特效需求!A$5:G$56,7,FALSE)","v":"对随机3名敌人造成灵魂力%的火属性物理伤害，\n为随机恢复2名友方恢复灵魂力%的生命。"}]
{"$rows_left_out":85}
{"sheet":"Sheet4","index":6,"n_rows":627,"n_cols":7,"rows_kept":627}
[null,"Id","Name","ShortDesc","Desc","ChangeInfo","Icon"]
[null,"int","string","string","string","string","int"]
[null,2,3,3,3,3,3]
[null,"技能id","技能名称","短描述","技能描述","技能改变内容","技能图标\n关联资源表"]
["默认值",0,"",null,"",null,0]
["正确性校对"]
["校对值"]
[null,1000111,"凌甲","用水源之力，护我躯体。","对敌方单体造成<color=#b4595eFF>85%</color>水属性物理伤害，\n有100%的概率对所有敌人造成<color=#4c805eFF>嘲讽效果</color>，持续5秒。","等级2 额外提升双抗15%，持续4秒。",201011]
[null,"1000112","凌甲","用水源之力，护我躯体。","对敌方单体造成<color=#b4595eFF>85%</color>水属性物理伤害，\n有100%的概率对所有敌人造成<color=#4c805eFF>嘲讽效果</color>，持续5秒，技能释放后提升自身15%双抗，持续4秒。","等级3 嘲讽效果持续时长提升至10秒，额外提升双抗20%，持续5秒。",201012]
[null,"1000113","凌甲","用水源之力，护我躯体。","对敌方单体造成<color=#b4595eFF>85%</color>水属性物理伤害，\n有100%的概率对所有敌人造成<color=#4c805eFF>嘲讽效果</color>，持续10秒，技能释放后提升自身20%双抗，持续6秒。","等级4 物理伤害提升至108%，额外双抗提升至30%，持续时间延长至6秒。",201013]
[null,"1000114","凌甲","用水源之力，护我躯体。","对敌方单体造成<color=#b4595eFF>108%</color>水属性物理伤害，\n有100%的概率对所有敌人造成<color=#4c805eFF>嘲讽效果</color>，持续10秒，技能释放后提升自身30%双抗，持续6秒。",null,201014]
[null,"1000115","凌甲","用水源之力，护我躯体。",null,null,201015]
[null,"1000121","震岳","斩破水源之利刃。","对敌方随机2人造成<color=#b4595eFF>165%</color>水属性物理伤害，\n有40%概率<color=#4c805eFF>眩晕敌方</color>其中1人，持续3秒。","等级2 物理伤害提升至185%。",201021]
[null,"1000122","震岳","斩破水源之利刃。","对敌方随机2人造成<color=#b4595eFF>185%</color>水属性物理伤害，\n有40%概率<color=#4c805eFF>眩晕敌方</color>其中1人，持续3秒。","等级3 眩晕概率提升至60%，持续时间提升至4秒。",201022]
[null,"1000123","震岳","斩破水源之利刃。","对敌方随机2人造成<color=#b4595eFF>185%</color>水属性物理伤害，\n有60%概率<color=#4c805eFF>眩晕敌方</color>其中1人，持续4秒。","等级4 物理伤害提升至205%，眩晕触发几率提升至60%，持续时间延长至5秒。",201023]
[null,"1000124","震岳","斩破水源之利刃。","对敌方随机2人造成<color=#b4595eFF>205%</color>水属性物理伤害，\n有60%概率<color=#4c805eFF>眩晕敌方</color>其中1人，持续5秒。",null,201024]
[null,"1000125","震岳","斩破水源之利刃。",null,null,201025]
[null,"1000211","啸牙","呼啸狂风的利齿。","对敌方单体造成<color=#b4595eFF>105%</color>风属性物理伤害，\n有80%的概率对所有敌人造成<color=#4c805eFF>嘲讽效果</color>，持续5秒。","等级2 提升自身攻击10%，持续4秒。",202011]
[null,"1000212","啸牙","呼啸狂风的利齿。","对敌方单体造成<color=#b4595eFF>105%</color>风属性物理伤害，\n有80%的概率对所有敌人造成<color=#4c805eFF>嘲讽效果</color>，持续5秒，技能释放后提升自身10%攻击，持续4秒。","等级3 嘲讽效果持续时间延长到10秒，提升自身攻击至15%",202012]
[null,"1000213","啸牙","呼啸狂风的利齿。","对敌方单体造成<color=#b4595eFF>105%</color>风属性物理伤害，\n有80%的概率对所有敌人造成<color=#4c805eFF>嘲讽效果</color>，持续10秒，技能释放后提升自身15%攻击，持续4秒。","等级4 物理伤害提升至135%，嘲讽效果持续延长至10秒，提升自身攻击至20%，持续时间延长至6秒。",202013]
{"$rows_left_out":608}
{"sheet":"y异妖技能","index":7,"n_rows":100,"n_cols":3,"rows_kept":100}
["对敌方随机3名敌人造成1000点伤害，增加我方2人攻击10%，持续5秒，增加防御20%，持续5秒。",{"$f":"CLEAN(SUBSTITUTE(SUBSTITUTE(SUBSTITUTE(SUBSTITUTE(SUBSTITUTE(SUBSTITUTE(SUBSTITUTE(A1,\"成\",\"成<color=#4c805eFF>\",1),\"点\",\"点</color>\",1),\"沉默\",\"<color=#4c805eFF>沉默</color>\",1),\"眩晕\",\"<color=#4c805eFF>眩晕</color>\",1),\"中毒目标\",\"<color=#4c805eFF>中毒目标</color>\",1),\"燃烧目标\",\"<color=#4c805eFF>燃烧目标</color>\",1),\"流血目标\",\"<color=#4c805eFF>流血目标</color>\",1))","v":"对敌方随机3名敌人造成<color=#4c805eFF>1000点</color>伤害，增加我方2人攻击10%，持续5秒，增加防御20%，持续5秒。"},"对敌方随机3名敌人造成1000点伤害，增加我方2人攻击10%，持续5秒，增加防御20%，持续5秒。"]
["对敌方随机3名敌人造成1000点伤害，增加我方2人攻击20%，持续5秒，增加防御20%，持续5秒。",{"$f":"CLEAN(SUBSTITUTE(SUBSTITUTE(SUBSTITUTE(SUBSTITUTE(SUBSTITUTE(SUBSTITUTE(SUBSTITUTE(A2,\"成\",\"成<color=#4c805eFF>\",1),\"点\",\"点</color>\",1),\"沉默\",\"<color=#4c805eFF>沉默</color>\",1),\"眩晕\",\"<color=#4c805eFF>眩晕</color>\",1),\"中毒目标\",\"<color=#4c805eFF>中毒目标</color>\",1),\"燃烧目标\",\"<color=#4c805eFF>燃烧目标</color>\",1),\"流血目标\",\"<color=#4c805eFF>流血目标</color>\",1))","v":"对敌方随机3名敌人造成<color=#4c805eFF>1000点</color>伤害，增加我方2人攻击20%，持续5秒，增加防御20%，持续5秒。"},"对敌方随机3名敌人造成1000点伤害，增加我方2人攻击<color=#4c805eFF>20%</color>，持续5秒，增加防御20%，持续5秒。"]
["对敌方随机3名敌人造成2000点伤害，增加我方2人攻击20%，持续5秒，增加防御20%，持续5秒。","对敌方随机3名敌人造成<color=#4c805eFF>2000点</color>伤害，增加我方2人攻击20%，持续5秒，增加防御20%，持续5秒。","对敌方随机3名敌人造成<color=#4c805eFF>2000点</color>伤害，增加我方2人攻击20%，持续5秒，增加防御20%，持续5秒。"]
["对敌方随机3名敌人造成2000点伤害，增加我方2人攻击30%，持续5秒，增加防御20%，持续5秒。","对敌方随机3名敌人造成<color=#4c805eFF>2000点</color>伤害，增加我方2人攻击30%，持续5秒，增加防御20%，持续5秒。","对敌方随机3名敌人造成2000点伤害，增加我方2人攻击<color=#4c805eFF>30%</color>，持续5秒，增加防御20%，持续5秒。"]
["对敌方随机3名敌人造成3000点伤害，增加我方2人攻击30%，持续5秒，增加防御20%，持续5秒。","对敌方随机3名敌人造成<color=#4c805eFF>3000点</color>伤害，增加我方2人攻击30%，持续5秒，增加防御20%，持续5秒。","对敌方随机3名敌人造成<color=#4c805eFF>3000点</color>伤害，增加我方2人攻击30%，持续5秒，增加防御20%，持续5秒。"]
["对敌方随机3名敌人造成3000点伤害，增加我方2人攻击30%，持续10秒，增加防御20%，持续5秒。","对敌方随机3名敌人造成<color=#4c805eFF>3000点</color>伤害，增加我方2人攻击30%，持续10秒，增加防御20%，持续5秒。","对敌方随机3名敌人造成<color=#4c805eFF>3000点</color>伤害，增加我方2人攻击30%，持续10秒，增加防御20%，持续5秒。"]
["对敌方随机3名敌人造成4000点伤害，增加我方2人攻击30%，持续10秒，增加防御20%，持续5秒。","对敌方随机3名敌人造成<color=#4c805eFF>4000点</color>伤害，增加我方2人攻击30%，持续10秒，增加防御20%，持续5秒。","对敌方随机3名敌人造成<color=#4c805eFF>4000点</color>伤害，增加我方2人攻击30%，持续10秒，增加防御20%，持续5秒。"]
["对敌方随机3名敌人造成4000点伤害，增加我方2人攻击30%，持续10秒，增加防御20%，持续10秒。","对敌方随机3名敌人造成<color=#4c805eFF>4000点</color>伤害，增加我方2人攻击30%，持续10秒，增加防御20%，持续10秒。","对敌方随机3名敌人造成<color=#4c805eFF>4000点</color>伤害，增加我方2人攻击30%，持续10秒，增加防御20%，持续10秒。"]
["对敌方随机3名敌人造成5000点伤害，增加我方2人攻击30%，持续10秒，增加防御20%，持续10秒。","对敌方随机3名敌人造成<color=#4c805eFF>5000点</color>伤害，增加我方2人攻击30%，持续10秒，增加防御20%，持续10秒。","对敌方随机3名敌人造成<color=#4c805eFF>5000点</color>伤害，增加我方2人攻击30%，持续10秒，增加防御20%，持续10秒。"]
["对敌方随机3名敌人造成5000点伤害，增加我方2人攻击30%，持续10秒，增加防御30%，持续10秒。","对敌方随机3名敌人造成<color=#4c805eFF>5000点</color>伤害，增加我方2人攻击30%，持续10秒，增加防御30%，持续10秒。","对敌方随机3名敌人造成<color=#4c805eFF>5000点</color>伤害，增加我方2人攻击30%，持续10秒，增加防御30%，持续10秒。"]
["对敌方随机2名敌人造成1800点伤害，降低对方速度20%，持续5秒，恢复我方4人20%的生命。","对敌方随机2名敌人造成<color=#4c805eFF>1800点</color>伤害，降低对方速度20%，持续5秒，恢复我方4人20%的生命。","对敌方随机2名敌人造成<color=#4c805eFF>1800点</color>伤害，降低对方速度20%，持续5秒，恢复我方4人20%的生命。"]
["对敌方随机2名敌人造成1800点伤害，降低对方速度30%，持续5秒，恢复我方4人20%的生命。","对敌方随机2名敌人造成<color=#4c805eFF>1800点</color>伤害，降低对方速度30%，持续5秒，恢复我方4人20%的生命。","对敌方随机2名敌人造成<color=#4c805eFF>1800点</color>伤害，降低对方速度30%，持续5秒，恢复我方4人20%的生命。"]
["对敌方随机2名敌人造成3600点伤害，降低对方速度30%，持续5秒，恢复我方4人20%的生命。","对敌方随机2名敌人造成<color=#4c805eFF>3600点</color>伤害，降低对方速度30%，持续5秒，恢复我方4人20%的生命。","对敌方随机2名敌人造成<color=#4c805eFF>3600点</color>伤害，降低对方速度30%，持续5秒，恢复我方4人20%的生命。"]
["对敌方随机2名敌人造成3600点伤害，降低对方速度40%，持续5秒，恢复我方4人20%的生命。","对敌方随机2名敌人造成<color=#4c805eFF>3600点</color>伤害，降低对方速度40%，持续5秒，恢复我方4人20%的生命。","对敌方随机2名敌人造成<color=#4c805eFF>3600点</color>伤害，降低对方速度40%，持续5秒，恢复我方4人20%的生命。"]
["对敌方随机2名敌人造成5400点伤害，降低对方速度40%，持续5秒，恢复我方4人20%的生命。","对敌方随机2名敌人造成<color=#4c805eFF>5400点</color>伤害，降低对方速度40%，持续5秒，恢复我方4人20%的生命。","对敌方随机2名敌人造成<color=#4c805eFF>5400点</color>伤害，降低对方速度40%，持续5秒，恢复我方4人20%的生命。"]
["对敌方随机2名敌人造成5400点伤害，降低对方速度40%，持续10秒，恢复我方4人20%的生命。","对敌方随机2名敌人造成<color=#4c805eFF>5400点</color>伤害，降低对方速度40%，持续10秒，恢复我方4人20%的生命。","对敌方随机2名敌人造成<color=#4c805eFF>5400点</color>伤害，降低对方速度40%，持续10秒，恢复我方4人20%的生命。"]
["对敌方随机2名敌人造成7200点伤害，降低对方速度40%，持续10秒，恢复我方4人20%的生命。","对敌方随机2名敌人造成<color=#4c805eFF>7200点</color>伤害，降低对方速度40%，持续10秒，恢复我方4人20%的生命。","对敌方随机2名敌人造成<color=#4c805eFF>7200点</color>伤害，降低对方速度40%，持续10秒，恢复我方4人20%的生命。"]
["对敌方随机2名敌人造成7200点伤害，降低对方速度40%，持续10秒，恢复我方4人30%的生命。","对敌方随机2名敌人造成<color=#4c805eFF>7200点</color>伤害，降低对方速度40%，持续10秒，恢复我方4人30%的生命。","对敌方随机2名敌人造成<color=#4c805eFF>7200点</color>伤害，降低对方速度40%，持续10秒，恢复我方4人30%的生命。"]
["对敌方随机2名敌人造成9000点伤害，降低对方速度40%，持续10秒，恢复我方4人30%的生命。","对敌方随机2名敌人造成<color=#4c805eFF>9000点</color>伤害，降低对方速度40%，持续10秒，恢复我方4人30%的生命。","对敌方随机2名敌人造成<color=#4c805eFF>9000点</color>伤害，降低对方速度40%，持续10秒，恢复我方4人30%的生命。"]
["对敌方随机2名敌人造成9000点伤害，降低对方速度50%，持续10秒，恢复我方4人30%的生命。","对敌方随机2名敌人造成<color=#4c805eFF>9000点</color>伤害，降低对方速度50%，持续10秒，恢复我方4人30%的生命。","对敌方随机2名敌人造成<color=#4c805eFF>9000点</color>伤害，降低对方速度50%，持续10秒，恢复我方4人30%的生命。"]
{"$rows_left_out":81}
{"sheet":"Sheet3","index":8,"n_rows":233,"n_cols":9,"rows_kept":233}
[]
[]
[{"$nulls":3},"原版记录"]
[{"$nulls":4},"1002411","狂风","小心我沙包大的拳头。","对敌方随机2人造成<color=#b4595eFF>54%</color>风属性物理伤害。",{"$f":"H5","v":"对敌方随机2人造成<color=#b4595eFF>62%</color>风属性物理伤害。"}]
[{"$nulls":4},"1002412","狂风","小心我沙包大的拳头。","对敌方随机2人造成<color=#b4595eFF>62%</color>风属性物理伤害。","对敌方随机2人造成<color=#b4595eFF>72%</color>风属性物理伤害。"]
[{"$nulls":4},"1002413","狂风","小心我沙包大的拳头。","对敌方随机2人造成<color=#b4595eFF>72%</color>风属性物理伤害。","对敌方随机2人造成<color=#b4595eFF>86%</color>风属性物理伤害。"]
[{"$nulls":4},"1002414","狂风","小心我沙包大的拳头。","对敌方随机2人造成<color=#b4595eFF>86%</color>风属性物理伤害。",{"$f":"\"\"","v":""}]
[{"$nulls":4},"1002415","狂风","小心我沙包大的拳头。","",{"$f":"I7","v":""}]
[{"$nulls":4},"1002421","风烈打","握紧的拳头，伴随烈风。","对敌方单体造成<color=#b4595eFF>76%</color>风属性物理伤害，有60%的概率眩晕目标，持续8秒。",{"$f":"H10","v":"对敌方单体造成<color=#b4595eFF>82%</color>风属性物理伤害，有60%的概率眩晕目标，持续8秒。"}]
[{"$nulls":4},"1002422","风烈打","握紧的拳头，伴随烈风。","对敌方单体造成<color=#b4595eFF>82%</color>风属性物理伤害，有60%的概率眩晕目标，持续8秒。","对敌方单体造成<color=#b4595eFF>96%</color>风属性物理伤害，有60%的概率眩晕目标，持续8秒。"]
[{"$nulls":4},"1002423","风烈打","握紧的拳头，伴随烈风。","对敌方单体造成<color=#b4595eFF>96%</color>风属性物理伤害，有60%的概率眩晕目标，持续8秒。","对敌方单体造成<color=#b4595eFF>110%</color>风属性物理伤害，有60%的概率眩晕目标，持续8秒。"]
[{"$nulls":4},"1002424","风烈打","握紧的拳头，伴随烈风。","对敌方单体造成<color=#b4595eFF>110%</color>风属性物理伤害，有60%的概率眩晕目标，持续8秒。",{"$f":"\"\"","v":""}]
[{"$nulls":4},"1002425","风烈打","握紧的拳头，伴随烈风。","",{"$f":"I12","v":""}]
[{"$nulls":4},"1002511","虎爪拳","嗷呜！吃我两拳！","对敌方单体造成2段<color=#b4595eFF>68%</color>火属性魔法伤害。",{"$f":"H15","v":"对敌方单体造成2段<color=#b4595eFF>76%</color>火属性魔法伤害。"}]
[{"$nulls":4},"1002512","虎爪拳","嗷呜！吃我两拳！","对敌方单体造成2段<color=#b4595eFF>76%</color>火属性魔法伤害。","对敌方单体造成2段<color=#b4595eFF>84%</color>火属性魔法伤害。"]
[{"$nulls":4},"1002513","虎爪拳","嗷呜！吃我两拳！","对敌方单体造成2段<color=#b4595eFF>84%</color>火属性魔法伤害。","对敌方单体造成2段<color=#b4595eFF>92%</color>火属性魔法伤害。"]
[{"$nulls":4},"1002514","虎爪拳","嗷呜！吃我两拳！","对敌方单体造成2段<color=#b4595eFF>92%</color>火属性魔法伤害。",{"$f":"\"\"","v":""}]
[{"$nulls":4},"1002515","虎爪拳","嗷呜！吃我两拳！","",{"$f":"I17","v":""}]
[{"$nulls":4},"1002521","萌虎怒气","我也是会生气哒！","对敌方单体造成<color=#b4595eFF>84%</color>火属性魔法伤害，有75%的概率眩晕目标，持续8秒。",{"$f":"H20","v":"对敌方单体造成<color=#b4595eFF>92%</color>火属性魔法伤害，有75%的概率眩晕目标，持续8秒。"}]
[{"$nulls":4},"1002522","萌虎怒气","我也是会生气哒！","对敌方单体造成<color=#b4595eFF>92%</color>火属性魔法伤害，有75%的概率眩晕目标，持续8秒。","对敌方单体造成<color=#b4595eFF>106%</color>火属性魔法伤害，有75%的概率眩晕目标，持续8秒。"]
{"$rows_left_out":213}