{"text_format":"3","workbook":"xlsx","n_sheets":6,"sheets":["ArtResourcesConfig","Sheet4","辅助表","Sheet1","Sheet2","Sheet3"],"not_rendered":{"external_links":2,"defined_names":3},"read":"whole","date_system":"1900"}

{"sheet":"ArtResourcesConfig","index":0,"n_rows":2159,"n_cols":7,"rows_kept":2159}
[null,"Id","Name","Desc","Info","Scale","Position"]
[null,"int","string","string","string","float","mut,float#float,1"]
[null,2,3,3,0,3,3]
[null,"id","资源名称","游戏内名字","详细","角色缩放值","位置"]
["默认值",0,{"$f":"\"\"","v":""},{"$f":"\"\"","v":""},{"$f":"\"\"","v":""},0,"null"]
["正确性校对"]
["校对值"]
[null,1,"MP_ExploreMap_sj_0010","怪","怪"]
[null,2,"MP_ExploreMap_sj_0011","精英怪","精英怪"]
[null,3,"ME_Explorer_0004","矿","矿"]
[null,4,"ME_Explorer_0001","出生点","出生点"]
[null,5,"ME_Explorer_0007","出口","出口"]
[null,6,"ME_Explorer_0002","探索点","探索点"]
[null,7,"ME_Explorer_0005","npc","npc"]
[null,8,null,"商人","商人"]
[null,9,null,"宝箱","宝箱"]
[null,10,"ME_Explorer_0002","驿馆头像","驿馆头像"]
[null,101,"s_shangcheng_hunjing_01","60妖精"]
[null,102,"s_shangcheng_hunjing_02","300妖精"]
[null,103,"s_shangcheng_hunjing_03","980妖精"]
[null,104,"s_shangcheng_hunjing_04","1980妖精"]
[null,105,"s_shangcheng_hunjing_05","3280妖精"]
[null,106,"s_shangcheng_hunjing_06","6480妖精"]
[null,201,"r_playerrumble_yiyao_01","蒸笼仔","长条立绘"]
[null,202,"r_playerrumble_yiyao_02","拘魂姬","长条立绘"]
[null,203,"r_playerrumble_yiyao_03","横公","长条立绘"]
[null,204,"r_playerrumble_yiyao_04","孙龙","长条立绘"]
[null,205,"r_playerrumble_yiyao_05","风狸","长条立绘"]
[null,206,"r_playerrumble_yiyao_06","刀捞鬼","长条立绘"]
[null,207,"r_playerrumble_yiyao_07","火鼠","长条立绘"]
[null,208,"r_playerrumble_yiyao_08","陌刀","长条立绘"]
[null,209,"r_playerrumble_yiyao_09","天麟","长条立绘"]
[null,210,"r_playerrumble_yiyao_10","拦面叟","长条立绘"]
[null,301,"gh_tt_1","公会图腾"]
[null,302,"gh_tt_2","公会图腾"]
[null,303,"gh_tt_3","公会图腾"]
[null,304,"gh_tt_4","公会图腾"]
[null,305,"gh_tt_5","公会图腾"]
[null,306,"gh_tt_6","公会图腾"]
[null,307,"gh_tt_7","公会图腾"]
[null,308,"gh_tt_8","公会图腾"]
[null,309,"gh_tt_9","公会图腾"]
[null,501,"s_sbtj_renwu","神兵天降","拍脸图"]
[null,502,"s_sbtj_biaoti","神兵天降文字","拍脸图"]
[null,503,"t_tsec_fengli","限时直购风狸","拍脸图"]
[null,504,"t_tsec_huoshu","限时直购火鼠","拍脸图"]
[null,505,"t_tsec_modao","限时直购陌刀","拍脸图"]
[null,506,"t_tsec_sunlong","限时直购孙龙","拍脸图"]
[null,507,"t_tsec_biaoti","天神恩赐文字","拍脸图"]
[null,1001,"c_fx_00028_t3","伏羲","角色id为1静态立绘"]
[null,1002,"c_ls_0004_t3","洛神","角色id为2静态立绘"]
[null,1003,"c_jbj_0007_t3","猪八戒","角色id为3静态立绘"]
[null,1004,"c_chdr_00030_t3","慈航道人","角色id为4静态立绘"]
[null,1005,"c_dj_0008_t3","妲己","角色id为5静态立绘"]
[null,1006,"c_gg_0005_t3","共工","角色id为6静态立绘"]
[null,1007,"c_ts_00017_t3","唐僧","角色id为7静态立绘"]
[null,1008,"c_jw_0003_t3","精卫","角色id为8静态立绘"]
[null,1009,"c_ljgz_00032_t3_png","龙吉公主","角色id为9静态立绘"]
[null,1010,"c_kqmw_00018_t3","孔雀明王","角色id为10静态立绘"]
[null,1011,"c_lzz_0002_t3","雷震子","角色id为11静态立绘"]
[null,1012,"c_xllh_00022_t3","降龙罗汉","角色id为12静态立绘"]
[null,1013,"c_ldb_00047_t3","吕洞宾","角色id为13静态立绘"]
[null,1014,"c_nz_00029_t3","哪吒","角色id为14静态立绘"]
[null,1015,"c_fhlh_00021_t3","伏虎罗汉","角色id为15静态立绘"]
[null,1016,"c_cy_00031_t3","蚩尤","角色id为16静态立绘"]
[null,1017,"c_ce_00034_t3","嫦娥","角色id为17静态立绘"]
[null,1018,"c_jmm_0006_t3","九命猫","角色id为18静态立绘"]
[null,1019,"c_jls_00044_t3_png","巨灵神","角色id为19静态立绘"]
[null,1020,"c_ghn_0009_t3","姑获鸟","角色id为20静态立绘"]
[null,1021,"c_dlsm_00033_t3_png","东陵圣母","角色id为21静态立绘"]
[null,1022,"c_wsps_00016_t3","达摩","角色id为22静态立绘"]
[null,1023,"c_swk_00015_t3_png","孙悟空","角色id为23静态立绘"]
[null,1024,"c_jzy_00043_t3","姜子牙","角色id为24静态立绘"]
[null,1025,"c_ddtz_00049_t3","道德天尊","角色id为25静态立绘"]
[null,1026,"c_dhdj_00042_t3","东华帝君","角色id为26静态立绘"]
[null,1027,"c_mp_00051_t3","孟婆","角色id为27静态立绘"]
[null,1028,"c_sjnn_00012_t3","石矶娘娘","角色id为28静态立绘"]
[null,1029,"c_ygps_00025_t3","月光菩萨","角色id为29静态立绘"]
[null,1030,"c_ft_00026_t3","梵天","角色id为30静态立绘"]
[null,1031,"c_hhe_00011_t3","红孩儿","角色id为31静态立绘"]
[null,1032,"c_wg_00037_t3","吴刚","角色id为32静态立绘"]
[null,1033,"c_gyps_00020_t3_png","净光天女","角色id为33静态立绘"]
[null,1034,"c_dst_00023_t3","帝释天","角色id为34静态立绘"]
[null,1035,"c_mz_00038_t3","妈祖","角色id为35静态立绘"]
[null,1036,"c_zgm_00039_t3","赵公明","角色id为36静态立绘"]
[null,1037,"c_lc_00050_t3","罗刹","角色id为37静态立绘"]
[null,1038,"c_yc_00052_t3","夜叉","角色id为38静态立绘"]
[null,1039,"c_pxps_00024_t3","普贤菩萨","角色id为39静态立绘"]
[null,1040,"c_yj_00040_t3_png","杨戬","角色id为40静态立绘"]
[null,1041,"c_ttjz_00048_t3","通天教主","角色id为41静态立绘"]
[null,1042,"c_jtxn_00045_t3_png","九天玄女","角色id为42静态立绘"]
[null,1043,"c_lslz_00046_t3_png","太阴星君","角色id为43静态立绘"]
[null,1044,"c_hsmw_00010_t3","混世魔王","角色id为44静态立绘"]
[null,1045,"c_bhxz_00013_t3","百花仙子","角色id为45静态立绘"]
[null,1046,"c_ny_00036_t3","女英","角色id为46静态立绘"]
[null,1047,"c_cff_0047_t3","大火妖","角色id为47静态立绘"]
[null,1048,"c_xv_00071_t3","雪女","角色id为48静态立绘"]
[null,1049,"c_cff_0049_t3","娜迦王","角色id为49静态立绘"]
[null,1050,"c_jff_0050_t3","摩呼","角色id为50静态立绘"]
[null,1051,"c_ym_0051_t3","半仙","角色id为51静态立绘"]
[null,1052,"c_hl_00075_t3","荷莲","角色id为52静态立绘"]
[null,1053,"c_cff_0047_t3","鬼差头子","角色id为53静态立绘"]
[null,1054,"c_yff_0048_t3","仙灵","角色id为54静态立绘"]
[null,1055,"c_cff_0049_t3","大淼淼","角色id为55静态立绘"]
[null,1056,"c_jff_0050_t3","大圭圭","角色id为56静态立绘"]
[null,1057,"c_nxq_00054_t3","聂小倩","角色id为57静态立绘"]
[null,1058,"c_jy_00055_t3","九婴","角色id为58静态立绘"]
[null,1059,"c_ygl_00056_t3","怨鬼灵","角色id为59静态立绘"]
[null,1060,"c_yhj_00057_t3","彼岸花","角色id为60静态立绘"]
[null,1061,"c_dz_00058_t3"," 地藏","角色id为61静态立绘"]
[null,1062,"c_jll_00059_t3","迦楼罗","角色id为62静态立绘"]
[null,1063,"c_jlzz_00060_t3","伽罗尊者","角色id为63静态立绘"]
[null,1064,"c_axl_00061_t3","阿修罗","角色id为64静态立绘"]
[null,1065,"c_mz_00062_t3","木吒","角色id为65静态立绘"]
[null,1066,"c_mjn_00063_t3","孟姜女","角色id为66静态立绘"]
[null,1067,"c_md_00064_t3","梦蝶","角色id为67静态立绘"]
[null,1068,"c_jz_00065_t3","七仙女","角色id为68静态立绘"]
[null,1069,"c_hdxj_00066_t3","火德星君","角色id为69静态立绘"]
[null,1070,"c_sdxj_00067_t3","水德星君","角色id为70静态立绘"]
[null,1071,"c_jhsn_00068_t3","九河神女","角色id为71静态立绘"]
[null,1072,"c_lsx_00069_t3","灵扇仙","角色id为72静态立绘"]
[null,1073,"c_hy_00078_t3","火妖","角色id为73静态立绘"]
[null,1074,"c_nj_00079_t3","娜迦奴","角色id为74静态立绘"]
[null,1075,"c_fs_00080_t3","方士","角色id为75静态立绘"]
[null,1076,"c_gc_00081_t3","鬼差","角色id为76静态立绘"]
[null,1077,"c_ym_0051_t3","大光","角色id为77静态立绘"]
[null,1078,"c_ym_0052_t3","大暗","角色id为78静态立绘"]
[null,1079,"c_xhy_00082_t3","小妖灵","角色id为79静态立绘"]
[null,1080,"c_ynj_00083_t3","幼娜灵","角色id为80静态立绘"]
[null,1081,"c_dt_00084_t3","方术灵","角色id为81静态立绘"]
[null,1082,"c_gcll_00085_t3","小道灵","角色id为82静态立绘"]
[null,1083,"c_ym_0051_t3","小光","角色id为83静态立绘"]
[null,1084,"c_ym_0052_t3","小暗","角色id为84静态立绘"]
[null,1085,"c_ab_00014_t3","敖丙","角色id为85静态立绘"]
[null,1086,"c_jcdp_00027_t3","金翅大鹏","角色id为86静态立绘"]
[null,1087,"c_eh_00035_t3","娥皇","角色id为87静态立绘"]
[null,1088,"c_sgb_00041_t3","申公豹","角色id为88静态立绘"]
[null,1089,"c_rd_00019_t3","燃灯","角色id为89静态立绘"]
[null,1090,"c_ylw_00053_t3","阎罗王","角色id为90静态立绘"]
[null,1091,"c_cff_0049_t3","小水","角色id为91静态立绘"]
[null,1092,"c_jff_0050_t3","小地","角色id为92静态立绘"]
[null,1093,"c_ym_0051_t3","小光","角色id为93静态立绘"]
[null,1094,"c_ym_0052_t3","小暗","角色id为94静态立绘"]
[null,1095,"c_hyt_0032_t3","一号","角色id为95静态立绘"]
[null,1096,"c_cff_0049_t3","二号","角色id为96静态立绘"]
[null,1097,"c_cff_0049_t3","三号","角色id为97静态立绘"]
[null,1098,"c_cff_0049_t3","四号","角色id为98静态立绘"]
[null,1099,"c_cff_0049_t3","五号","角色id为99静态立绘"]
[null,1100,"c_qf_0046_t3","六号","角色id为100静态立绘"]
[null,1501,"r_class_mifa",null,"角色职业秘法立绘"]
[null,1502,"r_class_shenghua",null,"角色职业天罚立绘"]
[null,1503,"r_class_tianfa",null,"角色职业武卫立绘"]
[null,1504,"r_class_wuwei",null,"角色职业玄策立绘"]
[null,1505,"r_class_xuance",null,"角色职业生花立绘"]
[null,1510,"r_CurrencyEquip_green",null,"绿色装备通用图标"]
[null,1511,"r_CurrencyEquip_blue",null,"蓝色装备通用图标"]
[null,1512,"r_CurrencyEquip_purple",null,"紫色装备通用图标"]
[null,1513,"r_CurrencyEquip_orange",null,"橙色装备通用图标"]
[null,1520,"r_RareItem_QuestNew_0001",null,"魔气碎块"]
[null,1521,"r_RareItem_QuestNew_0002",null,"吊桥钥匙"]
[null,1522,"r_RareItem_QuestNew_0003",null,"镇魔幡"]
[null,1523,"r_RareItem_QuestNew_0004",null,"魔王气息"]
[null,1524,"r_RareItem_QuestNew_0005",null,"匪徒腰牌"]
[null,1525,"r_RareItem_QuestNew_0006",null,"兽骨"]
[null,1526,"r_RareItem_QuestNew_0007",null,"野兽尖爪"]
[null,1527,"r_RareItem_QuestNew_0008",null,"尸毒玄骨"]
[null,1528,"r_RareItem_QuestNew_0009",null,"古猿白绒"]
[null,1529,"r_RareItem_QuestNew_0010",null,"盗贼的护身符"]
[null,1530,"r_RareItem_QuestNew_0011",null,"观澜珠"]
[null,1531,"r_RareItem_QuestNew_0011",null,"兽肉"]
[null,1532,"r_RareItem_QuestNew_0003",null,"刻笔"]
[null,1533,"r_RareItem_QuestNew_0001",null,"妖兽精血"]
[null,1534,"r_RareItem_QuestNew_0002",null,"迷魂之心"]
[null,1535,"r_RareItem_QuestNew_0004",null,"破损的兵器"]
[null,1536,"r_RareItem_MapReward_0004",null,"阵石"]
[null,1537,"r_RareItem_MapReward_0004",null,"记忆碎片"]
[null,1538,"r_RareItem_MapReward_0006",null,"木材"]
[null,1539,"r_RareItem_Quest_0012",null,"藏宝图"]
[null,1540,"r_RareItem_Quest_0014",null,"半卷藏宝图"]
[null,1541,"r_RareItem_QuestNew_0001",null,"忠义之心"]
[null,1542,"r_RareItem_QuestNew_0001",null,"仁慈之心"]
[null,1543,"r_RareItem_QuestNew_0001",null,"坚毅之心"]
[null,1544,"r_RareItem_QuestNew_0001",null,"羁绊之心"]
[null,1545,"r_RareItem_Quest_0024",null,"平民的财物"]
[null,1546,"r_RareItem_MapReward_0001",null,"长青叶"]
[null,1547,"r_RareItem_Quest_0009",null,"止血散"]
[null,1548,"r_RareItem_MapReward_0004",null,"耳目之石"]
[null,1549,"r_RareItem_Quest_0013",null,"饕餮之津"]
[null,1550,"r_RareItem_QuestNew_0001",null,"生死之悟"]
[null,1551,"r_RareMaterial_Talent_0003",null,"天山雪莲"]
[null,1801,"r_zjm_icon-jielin002",null,"戒灵"]
[null,1802,"r_zjm_yinyaoju",null,"异妖"]
[null,1803,"r_zjm_icon-chengyuan002",null,"成员"]
[null,1804,"r_zjm_icon-cangku002",null,"仓库"]
[null,1805,"r_zjm_icon-zhujue002",null,"主角"]
[null,1806,"r_zjm_tianfushu",null,"天赋"]
[null,1807,"r_zjm_haoyou",null,"好友"]
[null,1808,"r_zjm_richangrenwu",null,"日常任务"]
[null,1809,"r_zjm_huodongicon-yunmengqifu",null,"云梦祈福"]
[null,1810,"r_zjm_huodongicon-jielinmibao",null,"孙龙宝藏"]
[null,1811,"r_zjm_huodongicon-kaifuli",null,"开服有礼"]
[null,1812,"r_zjm_fuli",null,"福利"]
[null,1813,"r_zjm_xianshihuodong",null,"限时活动"]
[null,1814,"r_zjm_muyindian",null,"群英征募"]
[null,1815,"r_zjm_liulingge",null,"元素征募"]
[null,1816,"r_zjm_juyiting",null,"公会"]
[null,1817,"r_zjm_mijing",null,"秘境"]
[null,1818,"r_zjm_jingjichang",null,"竞技场"]
[null,1819,"r_zjm_liaotian",null,"聊天"]
[null,1820,"r_zjm_baibaozhai",null,"商店"]
[null,1821,"r_zjm_mibaoxuan",null,"秘盒"]
[null,1822,"r_zjm_xianjitan",null,"妖灵师分解"]
[null,1823,"r_zjm_gushi",null,"故事关卡"]
[null,1824,"r_zjm_juqingfuben",null,"剧情副本"]
[null,1825,"r_zjm_jingyingfuben",null,"精英"]
[null,1826,"r_zjm_shilianfuben",null,"试炼"]
[null,1827,"r_zjm_wujinfuben",null,"无尽"]
[null,1828,"r_zjm_suoyaota",null,"兽潮"]
[null,1829,"r_zjm_xuezhandaodi",null,"血战"]
[null,1830,"r_zjm_zhanlipaihang",null,"战力排行"]
[null,1831,"r_zjm_kaifukuanghuan",null,"开服狂欢"]
[null,1832,"r_zjm_changshulou",null,"图鉴"]
[null,1833,"r_zjm_guanxingtai",null,"占星"]
[null,1834,"r_zjm_qunxiongbang",null,"群雄榜"]
[null,1835,"r_zjm_doulinjing",null,"斗灵境"]
[null,1836,"r_zjm_huaxutan",null,"化虚坛"]
[null,1837,"r_zjm_xuanyuanbaojin",null,"轩辕宝境"]
[null,1838,"r_zjm_duanqige",null,"锻器阁"]
[null,2001,"live2d_c_fx_00028","伏羲","角色id为1动态立绘",0.55,"-15#114"]
[null,2002,"live2d_c_ls_0004","洛神","角色id为2动态立绘",0.28,"27#-481"]
[null,2003,"live2d_c_jbj_0007","猪八戒","角色id为3动态立绘",0.85,"-112#60"]
[null,2004,"live2d_c_chdr_00030","慈航道人","角色id为4动态立绘",0.7,"31#35"]
[null,2005,"live2d_c_dj_0008","妲己","角色id为5动态立绘",0.7,"0#145"]
[null,2006,"live2d_c_gg_0005","共工","角色id为6动态立绘",0.7,"40#120"]
[null,2007,"live2d_c_ts_00017","唐僧","角色id为7动态立绘",1.2,"-15#34"]
[null,2008,"live2d_c_jw_0003","精卫","角色id为8动态立绘",0.7,"-25#46"]
[null,2009,"live2d_c_ljgz_00032","龙吉公主","角色id为9动态立绘",0.85,"-112#60"]
[null,2010,"live2d_c_kqmw_00018","孔雀明王","角色id为10动态立绘",0.7,"31#35"]
[null,2011,"live2d_c_lzz_0002","雷震子","角色id为11动态立绘",0.7,"0#145"]
[null,2012,"live2d_c_xllh_00022","降龙罗汉","角色id为12动态立绘",0.85,"40#120"]
[null,2013,"live2d_c_ldb_00047","吕洞宾","角色id为13动态立绘",0.7,"-15#85"]
[null,2014,"live2d_c_nz_00029","哪吒","角色id为14动态立绘",0.5,"60#-86"]
[null,2015,"live2d_c_fhlh_00021","伏虎罗汉","角色id为15动态立绘",0.9,"-5.25#25"]
[null,2016,"live2d_c_cy_00031","蚩尤","角色id为16动态立绘",0.7,"31#35"]
[null,2017,"live2d_c_ce_00034","嫦娥","角色id为17动态立绘",0.7,"0#145"]
[null,2018,"live2d_c_jmm_0006","九命猫","角色id为18动态立绘",0.85,"40#120"]
[null,2019,"live2d_c_jls_00044","巨灵神","角色id为19动态立绘",0.7,"-15#85"]
[null,2020,"live2d_c_ghn_0009","姑获鸟","角色id为20动态立绘",0.5,"60#-86"]
[null,2021,"live2d_c_dlsm_00033","东陵圣母","角色id为21动态立绘",0.9,"-5.25#25"]
[null,2022,"live2d_c_wsps_00016","达摩","角色id为22动态立绘",0.6,"31#35"]
[null,2023,"live2d_c_swk_00015","孙悟空","角色id为23动态立绘",0.5,"0#145"]
[null,2024,"live2d_c_jzy_00043","姜子牙","角色id为24动态立绘",0.7,"40#120"]
[null,2025,"live2d_c_ddtz_00049","道德天尊","角色id为25动态立绘",0.8,"49.2#154"]
[null,2026,"live2d_c_dhdj_00042","东华帝君","角色id为26动态立绘",0.5,"1.5#74.7"]
[null,2027,"live2d_c_mp_00051","孟婆","角色id为27动态立绘",0.9,"-5.25#25"]
[null,2028,"live2d_c_sjnn_00012","石矶娘娘","角色id为28动态立绘",0.6,"31#35"]
[null,2029,"live2d_c_ygps_00025","月光菩萨","角色id为29动态立绘",0.5,"0#145"]
[null,2030,"live2d_c_ft_00026","梵天","角色id为30动态立绘",0.75,"40#160"]
[null,2031,"live2d_c_hhe_00011","红孩儿","角色id为31动态立绘",0.8,"49.2#154"]
[null,2032,"live2d_c_wg_00037","吴刚","角色id为32动态立绘",0.5,"1.5#74.7"]
[null,2033,"live2d_c_gyps_00020","净光天女","角色id为33动态立绘",0.9,"-5.25#25"]
[null,2034,"live2d_c_dst_00023","帝释天","角色id为34动态立绘",0.8,"31#35"]
[null,2035,"live2d_c_mz_00038","妈祖","角色id为35动态立绘",0.5,"0#145"]
[null,2036,"live2d_c_zgm_00039","赵公明","角色id为36动态立绘",0.7,"40#120"]
[null,2037,"live2d_c_lc_00050","罗刹","角色id为37动态立绘",0.7,"49.2#154"]
[null,2038,"live2d_c_yc_00052","夜叉","角色id为38动态立绘",0.5,"1.5#74.7"]
[null,2039,"live2d_c_pxps_00024","普贤菩萨","角色id为39动态立绘",0.9,"-5.25#25"]
[null,2040,"live2d_c_yj_00040","杨戬","角色id为40动态立绘",0.8,"31#35"]
[null,2041,"live2d_c_ttjz_00048","通天教主","角色id为41动态立绘",0.5,"0#145"]
[null,2042,"live2d_c_jtxn_00045","九天玄女","角色id为42动态立绘",0.7,"40#120"]
[null,2043,"live2d_c_lslz_00046","太阴星君","角色id为43动态立绘",0.7,"49.2#154"]
[null,2044,"live2d_c_hsmw_00010","混世魔王","角色id为44动态立绘",0.5,"1.5#74.7"]
[null,2045,"live2d_c_bhxz_00013","百花仙子","角色id为45动态立绘",0.9,"-5.25#25"]
[null,2046,"live2d_c_ny_00036","女英","角色id为46动态立绘",0.8,"31#35"]
[null,2047,"live2d_c_cff_0047","大火妖","角色id为47动态立绘",0.3,"3#-93"]
[null,2048,"live2d_c_xv_00071","雪女","角色id为48动态立绘",0.3,"3#-93"]
[null,2049,"live2d_c_cff_0049","娜迦王","角色id为49动态立绘",0.3,"3#-93"]
[null,2050,"live2d_c_jff_0050","摩呼","角色id为50动态立绘",0.3,"3#-93"]
[null,2051,"live2d_c_ym_0051","半仙","角色id为51动态立绘",0.9,"-5.25#25"]
[null,2052,"live2d_c_hl_00075","荷莲","角色id为52动态立绘",0.8,"31#35"]
[null,2053,"live2d_c_cff_0047","鬼差头子","角色id为53动态立绘",0.7,"104#145.5"]
[null,2054,"live2d_c_yff_0048","仙灵","角色id为54动态立绘",0.22,"67#210"]
[null,2055,"live2d_c_cff_0049","大淼淼","角色id为55动态立绘",0.22,"67#210"]
[null,2056,"live2d_c_jff_0050","大圭圭","角色id为56动态立绘",0.22,"67#210"]
[null,2057,"live2d_c_zs_0080","聂小倩","角色id为57动态立绘",0.22,"67#210"]
[null,2058,"live2d_c_xy_0026","九婴","角色id为58动态立绘",0.22,"67#210"]
[null,2059,"live2d_c_mlmn_0054","怨鬼灵","角色id为59动态立绘",0.22,"67#210"]
[null,2060,"live2d_c_fm_0027","彼岸花","角色id为60动态立绘",0.22,"67#210"]
[null,2061,"live2d_c_mc_0034"," 地藏","角色id为61动态立绘",0.22,"67#210"]
[null,2062,"live2d_c_yl_0014","迦楼罗","角色id为62动态立绘",0.22,"67#210"]
[null,2063,"live2d_c_jz_0002","伽罗尊者","角色id为63动态立绘",0.22,"67#210"]
[null,2064,"live2d_c_rj_0033","阿修罗","角色id为64动态立绘"]
[null,2065,"live2d_c_jpw_0024","木吒","角色id为65动态立绘"]
[null,2066,"live2d_c_xl_0030","孟姜女","角色id为66动态立绘"]
[null,2067,"live2d_c_y_0013","梦蝶","角色id为67动态立绘"]
[null,2068,"live2d_c_ch_0015","七仙女","角色id为68动态立绘"]
[null,2069,"live2d_c_cyh_0008","火德星君","角色id为69动态立绘"]
[null,2070,"live2d_c_qr_0065","水德星君","角色id为70动态立绘"]
[null,2071,"live2d_c_jhsn_0021","九河神女","角色id为71动态立绘"]
[null,2072,"live2d_c_ax_0067","灵扇仙","角色id为72动态立绘"]
[null,2073,"live2d_c_hy_00078","火妖","角色id为73动态立绘"]
[null,2074,"live2d_c_nj_00079","娜迦奴","角色id为74动态立绘"]
[null,2075,"live2d_c_fs_00080","方士","角色id为75动态立绘"]
[null,2076,"live2d_c_gc_00081","鬼差","角色id为76动态立绘"]
[null,2077,"live2d_c_ym_0051","大光","角色id为77动态立绘"]
[null,2078,"live2d_c_ym_0052","大暗","角色id为78动态立绘"]
[null,2079,"live2d_c_xhy_00082","小妖灵","角色id为79动态立绘"]
[null,2080,"live2d_c_ynj_00083","幼娜灵","角色id为80动态立绘"]
[null,2081,"live2d_c_dt_00084","方术灵","角色id为81动态立绘"]
[null,2082,"live2d_c_gcll_00085","小道灵","角色id为82动态立绘"]
[null,2083,"live2d_c_ym_0051","小光","角色id为83动态立绘"]
[null,2084,"live2d_c_ym_0052","小暗","角色id为84动态立绘"]
[null,2085,"live2d_c_ab_00014","敖丙","角色id为85动态立绘"]
[null,2086,"live2d_c_jcdp_00027","金翅大鹏","角色id为86动态立绘"]
[null,2087,"live2d_c_eh_00035","娥皇","角色id为87动态立绘"]
[null,2088,"live2d_c_sgb_00041","申公豹","角色id为88动态立绘"]
[null,2089,"live2d_c_rd_00019","燃灯","角色id为89动态立绘"]
[null,2090,"live2d_c_ylw_00053","阎罗王","角色id为90动态立绘"]
[null,2091,"live2d_c_yxz_0057","小火","角色id为91动态立绘"]
[null,2092,"live2d_c_ne_0058","小风","角色id为92动态立绘"]
[null,2093,"live2d_c_cff_0049","小水","角色id为93动态立绘"]
[null,2094,"live2d_c_jff_0050","小地","角色id为94动态立绘"]
[null,2095,"live2d_c_ym_0051","小光","角色id为95动态立绘"]
[null,2096,"live2d_c_ym_0052","小暗","角色id为96动态立绘"]
[null,2097,"live2d_c_hyt_0032","一号","角色id为97动态立绘"]
[null,2098,"live2d_c_cff_0049","二号","角色id为98动态立绘"]
[null,2099,"live2d_c_cff_0049","三号","角色id为99动态立绘"]
[null,2100,"live2d_c_cff_0049","四号","角色id为100动态立绘"]
[null,2101,"live2d_c_cff_0049","五号","角色id为101动态立绘"]
[null,2102,"live2d_c_qf_0046","六号","角色id为102动态立绘"]
[null,2501,"live2d_c_yxz_0057",null,"7日礼包"]
[null,2502,"live2d_c_ne_0058",null,"章节奖励"]
[null,3001,"c_fx_00028_t1","伏羲","角色id为1小头像"]
[null,3002,"c_ls_0004_t1","洛神","角色id为2小头像"]
[null,3003,"c_jbj_0007_t1","猪八戒","角色id为3小头像"]
[null,3004,"c_chdr_00030_t1","慈航道人","角色id为4小头像"]
[null,3005,"c_dj_0008_t1","妲己","角色id为5小头像"]
[null,3006,"c_gg_0005_t1","共工","角色id为6小头像"]
[null,3007,"c_ts_00017_t1","唐僧","角色id为7小头像"]
[null,3008,"c_jw_0003_t1","精卫","角色id为8小头像"]
[null,3009,"c_ljgz_00032_t1","龙吉公主","角色id为9小头像"]
[null,3010,"c_kqmw_00018_t1","孔雀明王","角色id为10小头像"]
[null,3011,"c_lzz_0002_t1","雷震子","角色id为11小头像"]
[null,3012,"c_xllh_00022_t1","降龙罗汉","角色id为12小头像"]
[null,3013,"c_ldb_00047_t1","吕洞宾","角色id为13小头像"]
[null,3014,"c_nz_00029_t1","哪吒","角色id为14小头像"]
[null,3015,"c_fhlh_00021_t1","伏虎罗汉","角色id为15小头像"]
[null,3016,"c_cy_00031_t1","蚩尤","角色id为16小头像"]
[null,3017,"c_ce_00034_t1","嫦娥","角色id为17小头像"]
[null,3018,"c_jmm_0006_t1","九命猫","角色id为18小头像"]
[null,3019,"c_jls_00044_t1","巨灵神","角色id为19小头像"]
[null,3020,"c_ghn_0009_t1","姑获鸟","角色id为20小头像"]
[null,3021,"c_dlsm_00033_t1","东陵圣母","角色id为21小头像"]
[null,3022,"c_wsps_00016_t1","达摩","角色id为22小头像"]
[null,3023,"c_swk_00015_t1","孙悟空","角色id为23小头像"]
[null,3024,"c_jzy_00043_t1","姜子牙","角色id为24小头像"]
[null,3025,"c_ddtz_00049_t1","道德天尊","角色id为25小头像"]
[null,3026,"c_dhdj_00042_t1","东华帝君","角色id为26小头像"]
[null,3027,"c_mp_00051_t1","孟婆","角色id为27小头像"]
[null,3028,"c_sjnn_00012_t1","石矶娘娘","角色id为28小头像"]
[null,3029,"c_ygps_00025_t1","月光菩萨","角色id为29小头像"]
[null,3030,"c_ft_00026_t1","梵天","角色id为30小头像"]
[null,3031,"c_hhe_00011_t1","红孩儿","角色id为31小头像"]
[null,3032,"c_wg_00037_t1","吴刚","角色id为32小头像"]
[null,3033,"c_gyps_00020_t1","净光天女","角色id为33小头像"]
[null,3034,"c_dst_00023_t1","帝释天","角色id为34小头像"]
[null,3035,"c_mz_00038_t1","妈祖","角色id为35小头像"]
[null,3036,"c_zgm_00039_t1","赵公明","角色id为36小头像"]
[null,3037,"c_lc_00050_t1","罗刹","角色id为37小头像"]
[null,3038,"c_yc_00052_t1","夜叉","角色id为38小头像"]
[null,3039,"c_pxps_00024_t1","普贤菩萨","角色id为39小头像"]
[null,3040,"c_yj_00040_t1","杨戬","角色id为40小头像"]
[null,3041,"c_ttjz_00048_t1","通天教主","角色id为41小头像"]
[null,3042,"c_jtxn_00045_t1","九天玄女","角色id为42小头像"]
[null,3043,"c_lslz_00046_t1","太阴星君","角色id为43小头像"]
[null,3044,"c_hsmw_00010_t1","混世魔王","角色id为44小头像"]
[null,3045,"c_bhxz_00013_t1","百花仙子","角色id为45小头像"]
[null,3046,"c_ny_00036_t1","女英","角色id为46小头像"]
[null,3047,"c_cff_0047_t1","大火妖","角色id为47小头像"]
[null,3048,"c_xv_00071_t1","雪女","角色id为48小头像"]
[null,3049,"c_cff_0049_t1","娜迦王","角色id为49小头像"]
[null,3050,"c_jff_0050_t1","摩呼","角色id为50小头像"]
[null,3051,"c_ym_0051_t1","半仙","角色id为51小头像"]
[null,3052,"c_hl_00075_t1","荷莲","角色id为52小头像"]
[null,3053,"c_cff_0047_t1","鬼差头子","角色id为53小头像"]
[null,3054,"c_yff_0048_t1","仙灵","角色id为54小头像"]
[null,3055,"c_cff_0049_t1","大淼淼","角色id为55小头像"]
[null,3056,"c_jff_0050_t1","大圭圭","角色id为56小头像"]
[null,3057,"c_nxq_00054_t1","聂小倩","角色id为57小头像"]
[null,3058,"c_jy_00055_t1","九婴","角色id为58小头像"]
[null,3059,"c_ygl_00056_t1","怨鬼灵","角色id为59小头像"]
[null,3060,"c_yhj_00057_t1","彼岸花","角色id为60小头像"]
[null,3061,"c_dz_00058_t1"," 地藏","角色id为61小头像"]
[null,3062,"c_jll_00059_t1","迦楼罗","角色id为62小头像"]
[null,3063,"c_jlzz_00060_t1","伽罗尊者","角色id为63小头像"]
[null,3064,"c_axl_00061_t1","阿修罗","角色id为64小头像"]
[null,3065,"c_mz_00062_t1","木吒","角色id为65小头像"]
[null,3066,"c_mjn_00063_t1","孟姜女","角色id为66小头像"]
[null,3067,"c_md_00064_t1","梦蝶","角色id为67小头像"]
[null,3068,"c_jz_00065_t1","七仙女","角色id为68小头像"]
[null,3069,"c_hdxj_00066_t1","火德星君","角色id为69小头像"]
[null,3070,"c_sdxj_00067_t1","水德星君","角色id为70小头像"]
[null,3071,"c_jhsn_00068_t1","九河神女","角色id为71小头像"]
[null,3072,"c_lsx_00069_t1","灵扇仙","角色id为72小头像"]
[null,3073,"c_hy_00078_t1","火妖","角色id为73小头像"]
[null,3074,"c_nj_00079_t1","娜迦奴","角色id为74小头像"]
[null,3075,"c_fs_00080_t1","方士","角色id为75小头像"]
[null,3076,"c_gc_00081_t1","鬼差","角色id为76小头像"]
[null,3077,"c_ym_0051_t1","大光","角色id为77小头像"]
[null,3078,"c_ym_0052_t1","大暗","角色id为78小头像"]
[null,3079,"c_xhy_00082_t1","小妖灵","角色id为79小头像"]
[null,3080,"c_ynj_00083_t1","幼娜灵","角色id为80小头像"]
[null,3081,"c_dt_00084_t1","方术灵","角色id为81小头像"]
[null,3082,"c_gcll_00085_t1","小道灵","角色id为82小头像"]
[null,3083,"c_ym_0051_t1","小光","角色id为83小头像"]
[null,3084,"c_ym_0052_t1","小暗","角色id为84小头像"]
[null,3085,"c_ab_00014_t1","敖丙","角色id为85小头像"]
[null,3086,"c_jcdp_00027_t1","金翅大鹏","角色id为86小头像"]
[null,3087,"c_eh_00035_t1","娥皇","角色id为87小头像"]
[null,3088,"c_sgb_00041_t1","申公豹","角色id为88小头像"]
[null,3089,"c_rd_00019_t1","燃灯","角色id为89小头像"]
[null,3090,"c_ylw_00053_t1","阎罗王","角色id为90小头像"]
[null,3091,"c_gt_0001_t1","默认头像男","角色id为91小头像"]
[null,3092,"c_bmf_0004_t1","默认头像女","角色id为92小头像"]
[null,3093,"c_ym_0051_t1","小光","角色id为93小头像"]
[null,3094,"c_ym_0052_t1","小暗","角色id为94小头像"]
[null,3095,"c_hyt_0032_t1","一号","角色id为95小头像"]
[null,3096,"c_cff_0049_t1","二号","角色id为96小头像"]
[null,3097,"c_cff_0049_t1","三号","角色id为97小头像"]
[null,3098,"c_cff_0049_t1","四号","角色id为98小头像"]
[null,3099,"c_cff_0049_t1","五号","角色id为99小头像"]
[null,3100,"c_qf_0046_t1","六号","角色id为100小头像"]
[null,4001,"r_characterbg_gray",null,"角色品质底图"]
[null,4002,"r_characterbg_green",null,"角色品质底图"]
[null,4003,"r_characterbg_blue",null,"角色品质底图"]
[null,4004,"r_characterbg_purple",null,"角色品质底图"]
[null,4005,"t_tongyong_topkaung",null,"角色品质底图"]
[null,5001,null,null,"蔡苟之——npc"]
[null,5002,null,null,"戒灵——npc"]
[null,6001,"bd_yiyaobeijin003",null,"壹"]
[null,6002,"bd_yiyaobeijin004",null,"贰"]
[null,6003,"bd_yiyaobeijin005",null,"叁"]
[null,6004,"r_tanxian_4",null,"肆"]
[null,6005,"r_tanxian_5",null,"伍"]
[null,6006,"r_shijie_06",null,"陆"]
[null,6007,"r_shijie_07",null,"柒"]
[null,6008,"r_shijie_08",null,"捌"]
[null,6009,"r_shijie_09",null,"玖"]
[null,6010,"r_shijie_10",null,"拾"]
[null,6501,"r_zhandou_changjing001",null,"战斗场景图1"]
[null,6502,"r_zhandou_changjing002",null,"战斗场景图2"]
[null,6503,"r_zhandou_changjing003",null,"战斗场景图3"]
[null,6504,"r_zhandou_changjing004",null,"战斗场景图4"]
[null,6505,"r_zhandou_changjing005",null,"战斗场景图5"]
[null,6506,"r_zhandou_changjing006",null,"战斗场景图6"]
[null,6507,"r_zhandou_changjing007",null,"战斗场景图7"]
[null,8000,"live2d_c_gt_0001","幸存者","剧情人物",{"$f":"F242","v":0.5},{"$f":"G242","v":"60#-86"}]
[null,8001,{"$f":"C457","v":"live2d_c_gt_0001"},"玩家","剧情人物",{"$f":"F242","v":0.5},{"$f":"G242","v":"60#-86"}]
[null,8002,"live2d_s_jieling_sl_3005","戒灵","剧情人物",0.85,"31#35"]
[null,8003,"live2d_n_jjlyfisher_0005","荆棘流域渔民","剧情人物"]
[null,8004,"live2d_c_fjzd_0055","白叶渡商人","剧情人物",0.7,"0#0"]
[null,8005,"live2d_n_glgsoldiercap_0007","观澜港守备军队长","剧情人物",0.7,"0#0"]
[null,8006,"live2d_c_rj_0033","观澜港士兵","剧情人物",0.7,"0#0"]
[null,8007,null,"御水之都平民","剧情人物"]
[null,8008,"live2d_n_glgsoldiercap_0007","御水之都城主护卫","剧情人物",0.7,"0#0"]
[null,8009,"live2d_s_jieling_tl_3002","天麟","剧情人物",0.8,"31#35"]
[null,8010,"live2d_s_jieling_sl_3005","孙龙","剧情人物",{"$f":"F459","v":0.85},{"$f":"G459","v":"31#35"}]
[null,8011,{"$f":"C268","v":"live2d_c_yj_00040"},"受伤的冒险者","剧情人物",{"$f":"F268","v":0.8},{"$f":"G268","v":"31#35"}]
[null,8012,{"$f":"C265","v":"live2d_c_lc_00050"},"被缚的冒险者","剧情人物",{"$f":"F265","v":0.7},{"$f":"G265","v":"49.2#154"}]
[null,8013,"live2d_m_jyw_0005","灵智妖兽","剧情人物",0.7,"0#100"]
[null,8014,"live2d_m_mmls_0045","痛苦的平民","剧情人物",0.7,"0#0"]
[null,8015,"live2d_m_mmls_0045","大山","剧情人物",0.7,"0#0"]
[null,8016,"live2d_n_nmmale_0014","平民","剧情人物",0.7,"0#0"]
[null,8017,"live2d_c_rj_0033","被控制的卫兵","剧情人物",0.7,"0#0"]
[null,8018,"live2d_n_glgsoldiercap_0007","卫兵头领","剧情人物",0.7,"0#0"]
[null,8019,"live2d_m_mz_0020","迷魂兽","剧情人物",0.7,"0#-20"]
[null,8020,"live2d_n_nmfemale_0013","女逃难者","剧情人物",0.7,"0#0"]
[null,8021,"live2d_n_nmmale_0014","男逃难者","剧情人物",0.7,"0#0"]
[null,8022,"live2d_m_hypd_0003","马贼","剧情人物",0.7,"0#-20"]
[null,8023,"live2d_m_jdjs_0009","妖兽","剧情人物",0.7,"0#-20"]
[null,8024,"live2d_m_hydyg_0001","马贼头领","剧情人物",0.7,"0#-20"]
[null,8025,"live2d_n_dp_0019","小叶","剧情人物",{"$f":"F270","v":0.7},{"$f":"G270","v":"40#120"}]
[null,8026,"live2d_n_jjlyfisher_0005","渔民","剧情人物",0.7,"0#0"]
[null,8027,null,"骷髅","剧情人物"]
[null,8028,"live2d_n_envelope_0016","书信内容","剧情人物",0.7,"0#0"]
[null,8029,"live2d_c_fjzd_0055","商人","剧情人物",0.7,"0#0"]
[null,8030,null,"惊天唳嚎","剧情人物"]
[null,8031,null,"神秘异兽","剧情人物"]
[null,8032,null,"暴怒的玉鲲","剧情人物"]
[null,8033,"live2d_c_rj_0033","守备军士兵","剧情人物",0.7,"0#0"]
[null,8034,"live2d_n_nmmale_0014","居民","剧情人物",0.7,"0#0"]
[null,8035,"live2d_n_dp_0019","地痞","剧情人物",0.7,"0#0"]
[null,8036,null,"地痞小头领","剧情人物"]
[null,8037,"live2d_n_hurtsoldier_0021","受伤的士兵","剧情人物",0.7,"0#0"]
[null,8038,"live2d_m_hyjl_0002","终亡信徒","剧情人物",0.7,"0#-20"]
[null,8039,"live2d_m_kn_0018","怪物","剧情人物",0.7,"0#-20"]
[null,8040,"live2d_c_rj_0033","守城士兵","剧情人物",0.7,"0#0"]
[null,8041,"live2d_n_glgsoldiercap_0007","护卫长","剧情人物",0.7,"0#0"]
[null,8042,"live2d_n_hurtsoldier_0021","受伤的护卫","剧情人物",0.7,"0#0"]
[null,8043,"live2d_m_hyjl_0002","罩袍人","剧情人物",0.7,"0#-20"]
[null,8044,"live2d_c_rj_0033","民兵","剧情人物",0.7,"0#0"]
[null,8045,null,"民兵甲","剧情人物"]
[null,8046,null,"民兵乙","剧情人物"]
[null,8047,null,"民兵丙","剧情人物"]
[null,8048,"live2d_m_xs_0041","幻灵","剧情人物",0.7,"0#0"]
[null,8049,null,"影子","剧情人物"]
[null,8050,null,"小影","剧情人物"]
[null,8051,null,"小影","剧情人物"]
[null,8052,"live2d_n_zpr_0024","蒙面人","剧情人物",0.7,"0#0"]
[null,8053,"live2d_n_yhttangzhu_0028","业火堂堂主","剧情人物",0.7,"0#0"]
[null,8054,null,"怨灵","副本人物"]
[null,8055,null,"恶鬼","副本人物"]
[null,8056,null,"幻草妖","副本人物"]
[null,8057,"live2d_m_ddk_0023","宝藏护卫","副本人物",0.7,"0#0"]
[null,8058,"live2d_m_dhx_0022","狐熊","副本人物",0.7,"0#0"]
[null,8059,null,"木羊帮打手","副本人物"]
[null,8060,null,"木羊帮小头领","副本人物"]
[null,8061,null,"木羊帮大长老","副本人物"]
[null,8062,null,"固灵之阵","副本BUFF点"]
[null,8063,null,"灭灵之阵","副本BUFF点"]
[null,8064,null,"无畏之灵","副本BUFF点"]
[null,8065,null,"狂战之灵","副本BUFF点"]
[null,8066,null,"金刚之灵","副本BUFF点"]
[null,8067,null,"贾裴文","剧情人物"]
[null,8068,null,"小影","剧情人物-黑影"]
[null,8069,null,"六耳金睛","剧情人物"]
[null,8070,null,"饕餮之魂","剧情人物"]
[null,8071,null,"天麟之影","剧情人物"]
[null,8072,null,"江一刀","剧情人物"]
[null,8073,null,"魑魅","精英人物",0.7,"0#0"]
[null,8074,null,"魍魉","精英人物",0.7,"0#0"]
[null,8075,null,"哥哥","精英人物",0.7,"0#0"]
[null,8076,null,"弟弟","精英人物",0.7,"0#0"]
[null,8077,null,"守墓人","精英人物"]
[null,8078,null,"古墓机关人","精英人物"]
[null,8079,null,"古墓石人","精英人物"]
[null,8080,null,"古墓墓主","精英人物"]
[null,8081,null,"盗墓人","精英人物"]
[null,8082,"live2d_c_ne_0058","宁月","剧情本人物",0.7,"0#0"]
[null,8083,"live2d_m_lrh_0027","噬魂妖兽","剧情本怪物",0.7,"0#0"]
[null,8084,null,"公告牌","剧情本摆设"]
[null,8085,null,"老李","剧情本人物"]
[null,8086,null,"野狼","剧情本人物"]
[null,8087,null,"野兽","剧情本人物"]
[null,8088,null,"人狼","剧情本人物"]
[null,8089,null,"韩灵儿","剧情本人物"]
[null,8090,null,"韩星","剧情本人物"]
[null,8091,null,"军官","剧情本人物"]
[null,8092,null,"士兵","剧情本人物"]
[null,8093,null,"小贩","剧情本人物"]
[null,8094,null,"混混","剧情本人物"]
[null,8095,null,"妇女","剧情本人物"]
[null,8096,null,"酒保","剧情本人物"]
[null,8097,null,"店主","剧情本人物"]
[null,8098,null,"酒鬼","剧情本怪物"]
[null,8099,null,"白木","剧情本人物"]
[null,8100,null,"混混头目","剧情本人物"]
[null,8101,null,"伙计","剧情本人物"]
[null,8102,null,"密会者","剧情本人物"]
[null,8103,null,"玩家（乔装）","剧情本人物"]
[null,8104,null,"楚恒（乔装）","剧情本人物"]
[null,8105,null,"神秘人","剧情本人物"]
[null,8106,null,"守备军","剧情本人物"]
[null,8107,null,"蒙面人","剧情本人物"]
[null,8108,null,"唤气师","精英本3人物"]
[null,8109,null,"居民的气息","精英本3人物"]
[null,8110,null,"财迷气息","精英本3人物"]
[null,8111,null,"卫兵气息","精英本3人物"]
[null,8112,null,"妇女气息","精英本3人物"]
[null,8113,null,"孩童气息","精英本3人物"]
[null,8114,null,"冒险者气息","精英本3人物"]
[null,8115,null,"铁匠气息","精英本3人物"]
[null,8116,null,"恶气","精英本3人物"]
[null,8117,null,"将军气息","精英本3人物"]
[null,8118,null,"妖兽气息","精英本3人物"]
[null,8119,null,"招灵信徒","精英本3人物"]
[null,8120,null,"金灵妖兽","精英本4人物"]
[null,8121,null,"木灵妖兽","精英本4人物"]
[null,8122,null,"水灵妖兽","精英本4人物"]
[null,8123,null,"火灵妖兽","精英本4人物"]
[null,8124,null,"土灵妖兽","精英本4人物"]
[null,8125,null,"阳灵信徒","精英本4人物"]
[null,8126,null,"阴灵信徒","精英本4人物"]
[null,8127,null,"驯兽信徒","精英本4人物"]
[null,8128,null,"材料商","无尽本1人物"]
[null,8129,null,"寻宝者","无尽本1人物"]
[null,8130,null,"独行猎妖师","无尽本1人物"]
[null,8131,null,"猎妖师","无尽本1人物"]
[null,8132,null,"盗宝者","无尽本1人物"]
[null,8133,null,"石奇","无尽本2人物"]
[null,8134,null,"小哈","无尽本2人物"]
[null,8135,null,"彼岸花妖","无尽本2人物"]
[null,8136,null,"溶洞妖兽","无尽本2人物"]
[null,8137,null,"阿良","无尽本2人物"]
[null,8138,null,"阿善","无尽本2人物"]
[null,8139,null,"巨石铭刻","无尽本2人物"]
[null,10001,"r_wujin_shangtubiao","行动力","行动力"]
[null,10002,"r_RareItem_Specail_0222","精力","精力"]
[null,10003,"r_LvUpItem_CharaGU_0001","成长护符","成长护符"]
[null,10004,"r_LvUpItem_CharaGU_0002","梦魇妖壶","梦魇妖壶"]
[null,10005,"r_LvUpItem_CharaGU_0003","灵丹","灵丹"]
[null,10006,"r_LvUpItem_CharaGU_0004","归元髓液","归元髓液"]
[null,10014,"r_Resource_Coin_0001","金币","金币"]
[null,10015,"r_Resource_Coin_0002","魂晶","魂晶"]
[null,10016,"r_Resource_Coin_0003","妖晶","妖晶"]
[null,10017,"r_Resource_Exp_0001","经验(玩家)","经验(玩家)"]
[null,10018,"r_Resource_Exp_0002","vip经验","vip经验"]
[null,10019,"r_RareItem_Specail_0001","聚灵券","聚灵券"]
[null,10020,"r_RareItem_Specail_0002","玄冥宝钞","玄冥宝钞"]
[null,11001,"r_Material_Mineral_0001","铁矿石","铁矿石"]
[null,11002,"r_Material_Mineral_0002","金矿石","金矿石"]
[null,11003,"r_Material_Mineral_0003","灵石","灵石"]
[null,11004,"r_Material_Mineral_0004","赤血石","赤血石"]
[null,11005,"r_Material_Mineral_0005","皮革","皮革"]
[null,11006,"r_Material_Mineral_0006","月影水晶","月影水晶"]
[null,11007,"r_Material_MakedMineral_0001","铁锭","铁锭"]
[null,11008,"r_Material_MakedMineral_0002","秘钢锭","秘钢锭"]
[null,11009,"r_Material_MakedMineral_0003","玄金锭","玄金锭"]
[null,11010,"r_Box_MineralBox_0001","小型铁矿堆","小型铁矿堆"]
[null,11011,"r_Box_MineralBox_0002","中型铁矿堆","中型铁矿堆"]
[null,11012,"r_Box_MineralBox_0003","大型铁矿堆","大型铁矿堆"]
[null,11013,"r_Box_MineralBox_0004","超大型铁矿堆","超大型铁矿堆"]
[null,11014,"r_Box_MineralBox_0005","小型灵石堆","小型灵石堆"]
[null,11015,"r_Box_MineralBox_0006","中型灵石堆","中型灵石堆"]
[null,11016,"r_Box_MineralBox_0007","大型灵石堆","大型灵石堆"]
[null,11017,"r_Box_MineralBox_0008","超大型灵石堆","超大型灵石堆"]
[null,11018,"r_Box_MineralBox_0009","小型金矿堆","小型金矿堆"]
[null,11019,"r_Box_MineralBox_0010","中型金矿堆","中型金矿堆"]
[null,11020,"r_Box_MineralBox_0011","大型金矿堆","大型金矿堆"]
[null,11021,"r_Box_MineralBox_0012","超大型金矿堆","超大型金矿堆"]
[null,11501,"r_RareItem_Specail_0003","遁地符","遁地符"]
[null,11502,"r_RareItem_Specail_0004","照妖镜","照妖镜"]
[null,11503,"r_RareItem_Specail_0005","镐头","镐头"]
[null,11504,"r_RareItem_MapPiece_0001","藏宝图碎片","藏宝图碎片"]
[null,11505,"r_RareItem_MapPiece_0002","太初藏宝图碎片","太初藏宝图碎片"]
[null,11506,"r_RareItem_Specail_0006","藏宝图","藏宝图"]
[null,11507,"r_RareItem_Specail_0007","公会御令","公会御令"]
[null,11508,"r_RareItem_Specail_0008","妖魂魔戒","秘盒招募道具。"]
[null,11509,"r_RareItem_Specail_0011","妖灵玉","秘盒商店的兑换道具。"]
[null,11510,"r_RareItem_Ticket_0001","挑战券","参与竞技场的门票"]
[null,11511,"r_RareItem_Specail_0013","荣耀徽章","竞技场代币"]
[null,11512,"r_RareItem_Specail_0010","精英证明","云游商人商店"]
[null,11513,"r_RareItem_Specail_0012","心火明晶","契魂商店代币"]
[null,11514,"r_RareItem_Specail_0001","普通入场券","普通副本门票"]
[null,11515,"r_RareItem_Ticket_0003","精英入场券","英雄副本门票"]
[null,11516,"r_Material_Mineral_0005","秘境升级材料","秘境升级材料"]
[null,11517,"r_RareItem_Specail_0030","至尊之证","巅峰赛代币"]
[null,12001,"r_RareMaterial_Rune_0001","高级符文","高级符文"]
[null,12002,"r_RareMaterial_Rune_0002","珍贵符文","珍贵符文"]
[null,12003,"r_RareMaterial_Rune_0003","史诗符文","史诗符文"]
[null,12004,"r_RareMaterial_Rune_0004","远古符文","远古符文"]
[null,12005,"r_Box_PieceBox_0014","远古妖魂宝箱","远古妖魂宝箱"]
[null,12006,"r_Box_PieceBox_0015","不朽妖魂宝箱","不朽妖魂宝箱"]
[null,12007,"r_Box_PieceBox_0003","刀劳鬼妖魂箱","刀劳鬼妖魂箱"]
[null,12008,"r_Box_PieceBox_0004","蒸笼仔妖魂箱","蒸笼仔妖魂箱"]
[null,12009,"r_Box_PieceBox_0005","拘魂姬妖魂箱","拘魂姬妖魂箱"]
[null,12010,"r_Box_PieceBox_0006","横公妖魂箱","横公妖魂箱"]
[null,12011,"r_Box_PieceBox_0007","孙龙妖魂箱","孙龙妖魂箱"]
[null,12012,"r_Box_PieceBox_0008","陌刀妖魂箱","陌刀妖魂箱"]
[null,12013,"r_Box_PieceBox_0009","火鼠妖魂箱","火鼠妖魂箱"]
[null,12014,"r_Box_PieceBox_0010","拦面叟妖魂箱","拦面叟妖魂箱"]
[null,12015,"r_Box_PieceBox_0011","风狸妖魂箱","风狸妖魂箱"]
[null,12016,"r_Box_PieceBox_0012","天麟妖魂箱","天麟妖魂箱"]
[null,12017,"r_Box_PieceBox_0013","神秘妖魂宝箱","神秘妖魂宝箱"]
[null,12018,"r_RareMaterial_Talent_0001","异界","异界"]
[null,12019,"r_RareMaterial_Talent_0002","烈日","烈日"]
[null,12020,"r_RareMaterial_Talent_0003","清月","清月"]
[null,12021,"r_RareMaterial_Talent_0004","辰星","辰星"]
[null,12022,"r_RareMaterial_Talent_0005","混沌","混沌"]
[null,12023,"r_RareItem_Specail_0014","深渊魔石","深渊魔石"]
[null,12024,"r_RareItem_Ticket_0002","外敌挑战券","外敌挑战券"]
[null,12025,"r_RareItem_Specail_0024","兽潮来袭门票","兽潮来袭门票"]
[null,12026,"r_RareItem_Specail_0015","试炼币","试炼币"]
[null,12027,"r_RareItem_Specail_0025","云梦华羽","云梦华羽"]
[null,12028,"r_RareItem_QuestNew_0003","判官笔","判官笔"]
[null,12029,"r_RareItem_Specail_0019","星魂","星魂"]
[null,12030,"r_RareItem_Specail_0020","修为丹","修为丹"]
[null,12031,"r_RareItem_Specail_0021","遗迹钱币","遗迹钱币"]
[null,12032,"r_RareItem_Specail_0018","改名卡","改名卡"]
[null,12033,"r_RareItem_Specail_0022","幸运探宝券","幸运探宝券"]
[null,12034,"r_RareItem_Specail_0023","高级探宝券","高级探宝券"]
[null,12035,"r_RareMaterial_Rune_0001","神州令","神州令"]
[null,12036,"r_Resource_Exp_0003","经验","经验"]
[null,12037,"r_RareItem_Specail_0027","返元露","返元露"]
[null,12038,"r_RareItem_Specail_0028","混沌玉","混沌玉"]
[null,12039,"r_RareItem_Specail_0029","寻龙玦","寻龙玦"]
[null,12040,"x_xb_gaoji","高级寻宝特权","高级寻宝"]
[null,12041,"x_xb_haohua","豪华寻宝特权","豪华寻宝"]
[null,12042,"r_RareItem_Specail_0031","寻仙玉","东海寻仙道具"]
[null,12043,"r_guanka_tansuojiachernganniu","极速探索","极速探索"]
[null,12044,"r_guanka_guajijiachenganniu","挂机收益","挂机收益"]
[null,12045,"r_RareItem_Specail_0009","疗心戒","疗心戒"]
[null,12046,"r_Resource_Coin_0004","【道】玉","【道】玉"]
[null,12047,"r_Resource_EquipTalismana_0002","舍利子","舍利子"]
[null,12048,"r_RareItem_Ticket_0003","召唤神符","召唤神符"]
[null,12049,"r_Material_tiangong_0001","战功","战功"]
[null,12050,"r_RareMaterial_Talent_0002","火魂玉","赤玉"]
[null,12051,"r_Resource_Coin_0004","置换玉","置换玉"]
[null,12052,"r_RareItem_QuestNew_0011","琉璃晶","琉璃晶"]
[null,12053,"r_Material_Mineral_0004","赤晶石","赤晶石"]
[null,12054,"t_tequan_xuanyuan","宝境挑战特权","宝境挑战特权"]
[null,13002,"r_equip_GS_0001","绿色武卫武器2","绿色武卫武器2"]
[null,13003,"r_equip_MW_0001","绿色生花武器1","绿色生花武器1"]
[null,13004,"r_equip_MW_0001","绿色生花武器2","绿色生花武器2"]
[null,13005,"r_equip_HW_0001","绿色秘法武器1","绿色秘法武器1"]
[null,13006,"r_equip_HW_0001","绿色秘法武器2","绿色秘法武器2"]
[null,13007,"r_equip_SH_0001","绿色天罚武器1","绿色天罚武器1"]
[null,13008,"r_equip_SH_0001","绿色天罚武器2","绿色天罚武器2"]
[null,13009,"r_equip_HS_0001","绿色玄策武器1","绿色玄策武器1"]
[null,13010,"r_equip_HS_0001","绿色玄策武器2","绿色玄策武器2"]
[null,13011,"r_equip_PA_0001","绿色板甲1","绿色板甲1"]
[null,13012,"r_equip_PA_0001","绿色板甲2","绿色板甲2"]
[null,13013,"r_equip_CA_0001","绿色布甲1","绿色布甲1"]
[null,13014,"r_equip_CA_0001","绿色布甲2","绿色布甲2"]
[null,13015,"r_equip_Shoes_0001","绿色鞋子1","绿色鞋子1"]
[null,13016,"r_equip_Shoes_0001","绿色鞋子2","绿色鞋子2"]
[null,13017,"r_equip_HA_0001","绿色头饰1","绿色头饰1"]
[null,13018,"r_equip_HA_0001","绿色头饰2","绿色头饰2"]
[null,13019,"r_equip_Rings_0001","绿色戒指","绿色戒指"]
[null,13020,"r_equip_Belt_0001","绿色腰带","绿色腰带"]
[null,13101,"r_equip_GS_0002","蓝色武卫武器1","蓝色武卫武器1"]
[null,13102,"r_equip_GS_0002","蓝色武卫武器2","蓝色武卫武器2"]
[null,13103,"r_equip_MW_0002","蓝色生花武器1","蓝色生花武器1"]
[null,13104,"r_equip_MW_0002","蓝色生花武器2","蓝色生花武器2"]
[null,13105,"r_equip_HW_0002","蓝色秘法武器1","蓝色秘法武器1"]
[null,13106,"r_equip_HW_0002","蓝色秘法武器2","蓝色秘法武器2"]
[null,13107,"r_equip_SH_0002","蓝色天罚武器1","蓝色天罚武器1"]
[null,13108,"r_equip_SH_0002","蓝色天罚武器2","蓝色天罚武器2"]
[null,13109,"r_equip_HS_0002","蓝色玄策武器1","蓝色玄策武器1"]
[null,13110,"r_equip_HS_0002","蓝色玄策武器2","蓝色玄策武器2"]
[null,13111,"r_equip_PA_0002","蓝色板甲1","蓝色板甲1"]
[null,13112,"r_equip_PA_0002","蓝色板甲2","蓝色板甲2"]
[null,13113,"r_equip_CA_0002","蓝色布甲1","蓝色布甲1"]
[null,13114,"r_equip_CA_0002","蓝色布甲2","蓝色布甲2"]
[null,13115,"r_equip_Shoes_0002","蓝色鞋子1","蓝色鞋子1"]
[null,13116,"r_equip_Shoes_0002","蓝色鞋子2","蓝色鞋子2"]
[null,13117,"r_equip_HA_0002","蓝色头饰1","蓝色头饰1"]
[null,13118,"r_equip_HA_0002","蓝色头饰2","蓝色头饰2"]
[null,13119,"r_equip_Rings_0002","蓝色戒指","蓝色戒指"]
[null,13120,"r_equip_Belt_0002","蓝色腰带","蓝色腰带"]
[null,13201,"r_equip_GS_0003","紫色武卫武器1","紫色武卫武器1"]
[null,13202,"r_equip_GS_0003","紫色武卫武器2","紫色武卫武器2"]
[null,13203,"r_equip_MW_0003","紫色生花武器1","紫色生花武器1"]
[null,13204,"r_equip_MW_0003","紫色生花武器2","紫色生花武器2"]
[null,13205,"r_equip_HW_0003","紫色秘法武器1","紫色秘法武器1"]
[null,13206,"r_equip_HW_0003","紫色秘法武器2","紫色秘法武器2"]
[null,13207,"r_equip_SH_0003","紫色天罚武器1","紫色天罚武器1"]
[null,13208,"r_equip_SH_0003","紫色天罚武器2","紫色天罚武器2"]
[null,13209,"r_equip_HS_0003","紫色玄策武器1","紫色玄策武器1"]
[null,13210,"r_equip_HS_0003","紫色玄策武器2","紫色玄策武器2"]
[null,13211,"r_equip_PA_0003","紫色板甲1","紫色板甲1"]
[null,13212,"r_equip_PA_0003","紫色板甲2","紫色板甲2"]
[null,13213,"r_equip_CA_0003","紫色布甲1","紫色布甲1"]
[null,13214,"r_equip_CA_0003","紫色布甲2","紫色布甲2"]
[null,13215,"r_equip_Shoes_0003","紫色鞋子1","紫色鞋子1"]
[null,13216,"r_equip_Shoes_0003","紫色鞋子2","紫色鞋子2"]
[null,13217,"r_equip_HA_0003","紫色头饰1","紫色头饰1"]
[null,13218,"r_equip_HA_0003","紫色头饰2","紫色头饰2"]
[null,13219,"r_equip_Rings_0003","紫色戒指","紫色戒指"]
[null,13220,"r_equip_Belt_0003","紫色腰带","紫色腰带"]
[null,13301,"r_equip_GS_0004","橙色武卫武器1","橙色武卫武器1"]
[null,13302,"r_equip_GS_0004","橙色武卫武器2","橙色武卫武器2"]
[null,13303,"r_equip_MW_0004","橙色生花武器1","橙色生花武器1"]
[null,13304,"r_equip_MW_0004","橙色生花武器2","橙色生花武器2"]
[null,13305,"r_equip_HW_0004","橙色秘法武器1","橙色秘法武器1"]
[null,13306,"r_equip_HW_0004","橙色秘法武器2","橙色秘法武器2"]
[null,13307,"r_equip_SH_0004","橙色天罚武器1","橙色天罚武器1"]
[null,13308,"r_equip_SH_0004","橙色天罚武器2","橙色天罚武器2"]
[null,13309,"r_equip_HS_0004","橙色玄策武器1","橙色玄策武器1"]
[null,13310,"r_equip_HS_0004","橙色玄策武器2","橙色玄策武器2"]
[null,13311,"r_equip_PA_0004","橙色板甲1","橙色板甲1"]
[null,13312,"r_equip_PA_0004","橙色板甲2","橙色板甲2"]
[null,13313,"r_equip_CA_0004","橙色布甲1","橙色布甲1"]
[null,13314,"r_equip_CA_0004","橙色布甲2","橙色布甲2"]
[null,13315,"r_equip_Shoes_0004","橙色鞋子1","橙色鞋子1"]
[null,13316,"r_equip_Shoes_0004","橙色鞋子2","橙色鞋子2"]
[null,13317,"r_equip_HA_0004","橙色头饰1","橙色头饰1"]
[null,13318,"r_equip_HA_0004","橙色头饰2","橙色头饰2"]
[null,13319,"r_equip_Rings_0004","橙色戒指","橙色戒指"]
[null,13320,"r_equip_Belt_0004","橙色腰带","橙色腰带"]
[null,13321,"r_equip_GS_0006","橙色武卫武器1_蓝图","橙色武卫武器1_蓝图"]
[null,13322,"r_equip_GS_0006","橙色武卫武器2_蓝图","橙色武卫武器2_蓝图"]
[null,13323,"r_equip_MW_0006","橙色生花武器1_蓝图","橙色生花武器1_蓝图"]
[null,13324,"r_equip_MW_0006","橙色生花武器2_蓝图","橙色生花武器2_蓝图"]
[null,13325,"r_equip_HW_0006","橙色秘法武器1_蓝图","橙色秘法武器1_蓝图"]
[null,13326,"r_equip_HW_0006","橙色秘法武器2_蓝图","橙色秘法武器2_蓝图"]
[null,13327,"r_equip_SH_0006","橙色天罚武器1_蓝图","橙色天罚武器1_蓝图"]
[null,13328,"r_equip_SH_0006","橙色天罚武器2_蓝图","橙色天罚武器2_蓝图"]
[null,13329,"r_equip_HS_0006","橙色玄策武器1_蓝图","橙色玄策武器1_蓝图"]
[null,13330,"r_equip_HS_0006","橙色玄策武器2_蓝图","橙色玄策武器2_蓝图"]
[null,13331,"r_equip_PA_0006","橙色板甲1_蓝图","橙色板甲1_蓝图"]
[null,13332,"r_equip_PA_0006","橙色板甲2_蓝图","橙色板甲2_蓝图"]
[null,13333,"r_equip_CA_0006","橙色布甲1_蓝图","橙色布甲1_蓝图"]
[null,13334,"r_equip_CA_0006","橙色布甲2_蓝图","橙色布甲2_蓝图"]
[null,13335,"r_equip_Shoes_0006","橙色鞋子1_蓝图","橙色鞋子1_蓝图"]
[null,13336,"r_equip_Shoes_0006","橙色鞋子2_蓝图","橙色鞋子2_蓝图"]
[null,13337,"r_equip_HA_0006","橙色头饰1_蓝图","橙色头饰1_蓝图"]
[null,13338,"r_equip_HA_0006","橙色头饰2_蓝图","橙色头饰2_蓝图"]
[null,13339,"r_RareItem_Recipe_0001","蓝图通用图标","蓝图通用图标"]
[null,14001,"r_equip_GS_0005","紫色武卫武器1_蓝图","紫色武卫武器1_蓝图"]
[null,14002,"r_equip_MW_0005","紫色生花武器1_蓝图","紫色生花武器1_蓝图"]
[null,14003,"r_equip_HW_0005","紫色秘法武器1_蓝图","紫色秘法武器1_蓝图"]
[null,14004,"r_equip_SH_0005","紫色天罚武器1_蓝图","紫色天罚武器1_蓝图"]
[null,14005,"r_equip_HS_0005","紫色玄策武器1_蓝图","紫色玄策武器1_蓝图"]
[null,14006,"r_equip_PA_0005","紫色板甲1_蓝图","紫色板甲1_蓝图"]
[null,14007,"r_equip_CA_0005","紫色布甲1_蓝图","紫色布甲1_蓝图"]
[null,14008,"r_equip_Shoes_0005","紫色鞋子1_蓝图","紫色鞋子1_蓝图"]
[null,14009,"r_equip_HA_0005","紫色头饰1","紫色头饰1"]
[null,14101,"r_equip_GS_0006","橙色武卫武器1_蓝图","橙色武卫武器1_蓝图"]
[null,14102,"r_equip_GS_0006","橙色武卫武器2_蓝图","橙色武卫武器2_蓝图"]
[null,14103,"r_equip_MW_0006","橙色生花武器1_蓝图","橙色生花武器1_蓝图"]
[null,14104,"r_equip_MW_0006","橙色生花武器2_蓝图","橙色生花武器2_蓝图"]
[null,14105,"r_equip_HW_0006","橙色秘法武器1_蓝图","橙色秘法武器1_蓝图"]
[null,14106,"r_equip_HW_0006","橙色秘法武器2_蓝图","橙色秘法武器2_蓝图"]
[null,14107,"r_equip_SH_0006","橙色天罚武器1_蓝图","橙色天罚武器1_蓝图"]
[null,14108,"r_equip_SH_0006","橙色天罚武器2_蓝图","橙色天罚武器2_蓝图"]
[null,14109,"r_equip_HS_0006","橙色玄策武器1_蓝图","橙色玄策武器1_蓝图"]
[null,14110,"r_equip_HS_0006","橙色玄策武器2_蓝图","橙色玄策武器2_蓝图"]
[null,14111,"r_equip_PA_0006","橙色板甲1_蓝图","橙色板甲1_蓝图"]
[null,14112,"r_equip_PA_0006","橙色板甲2_蓝图","橙色板甲2_蓝图"]
[null,14113,"r_equip_CA_0006","橙色布甲1_蓝图","橙色布甲1_蓝图"]
[null,14114,"r_equip_CA_0006","橙色布甲2_蓝图","橙色布甲2_蓝图"]
[null,14115,"r_equip_Shoes_0006","橙色鞋子1_蓝图","橙色鞋子1_蓝图"]
[null,14116,"r_equip_Shoes_0006","橙色鞋子2_蓝图","橙色鞋子2_蓝图"]
[null,14117,"r_equip_HA_0006","橙色头饰1_蓝图","橙色头饰1_蓝图"]
[null,14118,"r_equip_HA_0006","橙色头饰2_蓝图","橙色头饰2_蓝图"]
[null,16001,"r_jieling_zlz_3001_SoulCrystal","蒸笼仔","桃竹笼"]
[null,16002,"r_jieling_zlz_3001_ElementJade","蒸笼仔","玄蒲叶"]
[null,16003,"r_jieling_zlz_3001_SpiritPrime","蒸笼仔","灵隐螭"]
[null,16004,"r_jieling_hg_3002_SoulCrystal","横公","移命杖"]
[null,16005,"r_jieling_hg_3002_ElementJade","横公","吉钱冠"]
[null,16006,"r_jieling_hg_3002_SpiritPrime","横公","聚宝坠"]
[null,16007,"r_jieling_jhj_3003_SoulCrystal","拘魂姬","玲玉笛"]
[null,16008,"r_jieling_jhj_3003_ElementJade","拘魂姬","宿元镜"]
[null,16009,"r_jieling_jhj_3003_SpiritPrime","拘魂姬","天宁栓"]
[null,16010,"r_jieling_dlg_3010_SoulCrystal","刀劳鬼","朔方铃"]
[null,16011,"r_jieling_dlg_3010_ElementJade","刀劳鬼","狱魔角"]
[null,16012,"r_jieling_dlg_3010_SpiritPrime","刀劳鬼","荒之息"]
[null,16013,"r_jieling_tl_3004_SoulCrystal","天麟","金丝逆鳞"]
[null,16014,"r_jieling_tl_3004_ElementJade","天麟","贮雷妖珠"]
[null,16015,"r_jieling_tl_3004_SpiritPrime","天麟","麟龙金角"]
[null,16016,"r_jieling_tl_3004_SkillStarGem","天麟","聚灵之戒"]
[null,16017,"r_jieling_sl_3005_SoulCrystal","孙龙","笑面谱"]
[null,16018,"r_jieling_sl_3005_ElementJade","孙龙","映心剑"]
[null,16019,"r_jieling_sl_3005_SpiritPrime","孙龙","渴魂刀"]
[null,16020,"r_jieling_sl_3005_SkillStarGem","孙龙","魔烟罗"]
[null,16021,"r_jieling_hr_3006_SoulCrystal","火鼠","通灵火"]
[null,16022,"r_jieling_hr_3006_ElementJade","火鼠","化形绫"]
[null,16023,"r_jieling_hr_3006_SpiritPrime","火鼠","猼鼠皮"]
[null,16024,"r_jieling_hr_3006_SkillStarGem","火鼠","无忌鬃"]
[null,16025,"r_jieling_md_3007_SoulCrystal","陌刀","九阴刃"]
[null,16026,"r_jieling_md_3007_ElementJade","陌刀","武藏卷"]
[null,16027,"r_jieling_md_3007_SpiritPrime","陌刀","战鬼血"]
[null,16028,"r_jieling_md_3007_SkillStarGem","陌刀","四臂骸"]
[null,16029,"r_jieling_fl_3008_SoulCrystal","风狸","鳛风刀"]
[null,16030,"r_jieling_fl_3008_ElementJade","风狸","镇魂酒"]
[null,16031,"r_jieling_fl_3008_SpiritPrime","风狸","扶桑鼬"]
[null,16032,"r_jieling_fl_3008_SkillStarGem","风狸","舞阳纹"]
[null,16033,"r_jieling_lmr_3009_SoulCrystal","拦面叟","镔烟锅"]
[null,16034,"r_jieling_lmr_3009_ElementJade","拦面叟","天竺笠"]
[null,16035,"r_jieling_lmr_3009_SpiritPrime","拦面叟","那迦珠"]
[null,16036,"r_jieling_lmr_3009_SkillStarGem","拦面叟","凝云符"]
[null,17001,"s_jieling_dlg_3010_driveskill","刀捞鬼","技能图标"]
[null,17002,"s_jieling_zlz_3001_driveskill","蒸笼仔","技能图标"]
[null,17003,"s_jieling_hg_3002_driveskill","横公","技能图标"]
[null,17004,"s_jieling_jhj_3003_driveskill","拘魂姬","技能图标"]
[null,17005,"s_jieling_hs_3006_driveskill","火鼠","技能图标"]
[null,17006,"s_jieling_lms_3009_driveskill","拦面叟","技能图标"]
[null,17007,"s_jieling_sl_3005_driveskill","孙龙","技能图标"]
[null,17008,"s_jieling_md_3007_driveskill","陌刀","技能图标"]
[null,17009,"s_jieling_fl_3008_driveskill","风狸","技能图标"]
[null,17010,"s_jieling_tl_3004_driveskill","天麟","技能图标"]
[null,18001,"r_RareMaterial_Rune_0001","高级混沌符文","高级混沌符文"]
[null,18002,"r_RareMaterial_Rune_0001","高级生命符文","高级生命符文"]
[null,18003,"r_RareMaterial_Rune_0001","高级灵魂力符文","高级灵魂力符文"]
[null,18004,"r_RareMaterial_Rune_0001","高级护甲符文","高级护甲符文"]
[null,18005,"r_RareMaterial_Rune_0001","高级抗性符文","高级抗性符文"]
[null,18006,"r_RareMaterial_Rune_0001","高级速度符文","高级速度符文"]
[null,18007,"r_RareMaterial_Rune_0002","珍贵混沌符文","珍贵混沌符文"]
[null,18008,"r_RareMaterial_Rune_0002","珍贵生命符文","珍贵生命符文"]
[null,18009,"r_RareMaterial_Rune_0002","珍贵灵魂力符文","珍贵灵魂力符文"]
[null,18010,"r_RareMaterial_Rune_0002","珍贵护甲符文","珍贵护甲符文"]
[null,18011,"r_RareMaterial_Rune_0002","珍贵抗性符文","珍贵抗性符文"]
[null,18012,"r_RareMaterial_Rune_0002","珍贵速度符文","珍贵速度符文"]
[null,18013,"r_RareMaterial_Rune_0003","史诗混沌符文","史诗混沌符文"]
[null,18014,"r_RareMaterial_Rune_0003","史诗生命符文","史诗生命符文"]
[null,18015,"r_RareMaterial_Rune_0003","史诗灵魂力符文","史诗灵魂力符文"]
[null,18016,"r_RareMaterial_Rune_0003","史诗护甲符文","史诗护甲符文"]
[null,18017,"r_RareMaterial_Rune_0003","史诗抗性符文","史诗抗性符文"]
[null,18018,"r_RareMaterial_Rune_0003","史诗速度符文","史诗速度符文"]
[null,18019,"r_RareMaterial_Rune_0004","传说混沌符文","传说混沌符文"]
[null,18020,"r_RareMaterial_Rune_0004","传说生命符文","传说生命符文"]
[null,18021,"r_RareMaterial_Rune_0004","传说灵魂力符文","传说灵魂力符文"]
[null,18022,"r_RareMaterial_Rune_0004","传说护甲符文","传说护甲符文"]
[null,18023,"r_RareMaterial_Rune_0004","传说抗性符文","传说抗性符文"]
[null,18024,"r_RareMaterial_Rune_0004","传说速度符文","传说速度符文"]
[null,18025,"r_RareMaterial_Rune_0003","史诗减伤符文","史诗减伤符文"]
[null,18026,"r_RareMaterial_Rune_0003","史诗增伤符文","史诗增伤符文"]
[null,18027,"r_RareMaterial_Rune_0003","史诗命中符文","史诗命中符文"]
[null,18028,"r_RareMaterial_Rune_0003","史诗抵抗符文","史诗抵抗符文"]
[null,18029,"r_RareMaterial_Rune_0003","史诗暴击符文","史诗暴击符文"]
[null,18030,"r_RareMaterial_Rune_0003","史诗暴伤符文","史诗暴伤符文"]
[null,18031,"r_RareMaterial_Rune_0004","传说减伤符文","传说减伤符文"]
[null,18032,"r_RareMaterial_Rune_0004","传说增伤符文","传说增伤符文"]
[null,18033,"r_RareMaterial_Rune_0004","传说命中符文","传说命中符文"]
[null,18034,"r_RareMaterial_Rune_0004","传说抵抗符文","传说抵抗符文"]
[null,18035,"r_RareMaterial_Rune_0004","传说暴击符文","传说暴击符文"]
[null,18036,"r_RareMaterial_Rune_0004","传说暴伤符文","传说暴伤符文"]
[null,18037,"r_RareMaterial_Rune_0004","传说火焰符文","传说火焰符文"]
[null,18038,"r_RareMaterial_Rune_0004","传说碧水符文","传说碧水符文"]
[null,18039,"r_RareMaterial_Rune_0004","传说清风符文","传说清风符文"]
[null,18040,"r_RareMaterial_Rune_0004","传说大地符文","传说大地符文"]
[null,18041,"r_RareMaterial_Rune_0004","传说光明符文","传说光明符文"]
[null,18042,"r_RareMaterial_Rune_0004","传说暗黑符文","传说暗黑符文"]
[null,18043,"r_RareMaterial_Rune_0004","传说烈焰符文","传说烈焰符文"]
[null,18044,"r_RareMaterial_Rune_0004","传说洛水符文","传说洛水符文"]
[null,18045,"r_RareMaterial_Rune_0004","传说狂风符文","传说狂风符文",0.5]
[null,18046,"r_RareMaterial_Rune_0004","传说裂地符文","传说裂地符文",0.5]
[null,18047,"r_RareMaterial_Rune_0004","传说纯白符文","传说纯白符文",0.5]
[null,18048,"r_RareMaterial_Rune_0004","传说黑曜符文","传说黑曜符文",0.5]
[null,18501,"r_RareMaterial_Rune_0001","高级通用符文","高级通用符文"]
[null,18502,"r_RareMaterial_Rune_0002","珍贵通用符文","珍贵通用符文"]
[null,18503,"r_RareMaterial_Rune_0003","史诗通用符文","史诗通用符文"]
[null,18504,"r_RareMaterial_Rune_0004","传说通用符文","传说通用符文"]
[null,19001,"live2d_m_kl_0007","魔术骷髅","魔术骷髅",0.7,"0#-20"]
[null,19002,"live2d_m_jy_0004","无名角羊","无名角羊",0.7,"0#0"]
[null,19003,"live2d_m_jzkl_0006","烛刃骷髅","烛刃骷髅",0.7,"0#-50"]
[null,19004,"live2d_m_jyw_0005","无名角羊王","无名角羊王",0.7,"0#100"]
[null,19005,"live2d_m_hydyg_0001","山寨典狱官","山寨典狱官",0.7,"0#-20"]
[null,19006,"live2d_m_fwkl_0010","符文骷髅","符文骷髅",0.7,"0#-20"]
[null,19007,"live2d_m_bahy_0017","彼岸花妖","彼岸花妖",0.7,"0#-20"]
[null,19008,"live2d_m_jdjs_0009","巨大僵尸","巨大僵尸",0.7,"0#-20"]
[null,19009,"live2d_m_ds_0011","顽皮地鼠","顽皮地鼠",0.7,"0#-20"]
[null,19010,"live2d_m_rtz_0012","食肉兔","食肉兔",0.7,"0#-20"]
[null,19011,"live2d_m_djy_0013","巨猿","巨猿",0.7,"0#-20"]
[null,19013,"live2d_m_jy_0004","风见角羊","风见角羊",0.7,"0#-20"]
[null,19015,"live2d_m_fwwb_0016","港口卫兵","港口卫兵",0.7,"0#-20"]
[null,19016,"live2d_m_hwws_0008","港口翼人护卫","港口翼人护卫",0.7,"0#-20"]
[null,19017,"live2d_m_kn_0018","白叶翼魔","白叶翼魔",0.7,"0#-20"]
[null,19018,"live2d_m_wy_0019","白叶亡灵法师","白叶亡灵法师",0.7,"0#-20"]
[null,19019,"live2d_m_mz_0020","白叶爪刃魔","白叶爪刃魔",0.7,"0#-20"]
[null,19020,"live2d_m_jdjs_0009","荆棘巨大僵尸","荆棘巨大僵尸",0.7,"0#-20"]
[null,19021,"live2d_m_jyw_0005","荆棘角羊王","荆棘角羊王",0.7,"0#-20"]
[null,19022,"live2d_m_kn_0018","荆棘翼魔","荆棘翼魔",0.7,"0#-20"]
[null,19023,"live2d_m_dhx_0022","荆棘狐熊","荆棘狐熊",0.7,"0#-20"]
[null,19024,"live2d_m_gc_0025","荆棘笑面棺材","荆棘笑面棺材",0.7,"0#-20"]
[null,19025,"live2d_m_ddk_0023","荆棘独轮刺客","荆棘独轮刺客",0.7,"0#-20"]
[null,19026,"live2d_m_sg_0024","荆棘烛刑鬼","荆棘烛刑鬼",0.7,"0#-20"]
[null,19027,"live2d_m_jyw_0005","御水角羊王","御水角羊王",0.7,"0#-20"]
[null,19028,"live2d_m_kn_0018","御水翼魔","御水翼魔",0.7,"0#-20"]
[null,19029,"live2d_m_dhx_0022","御水狐熊","御水狐熊",0.7,"0#-20"]
[null,19030,"live2d_m_ddk_0023","御水独轮刺客","御水独轮刺客",0.7,"0#-20"]
[null,19031,"live2d_m_sg_0024","御水烛刑鬼","御水烛刑鬼",0.7,"0#-20"]
[null,19032,"live2d_m_fwwb_0016","御水卫兵","御水卫兵",0.7,"0#-20"]
[null,19033,"live2d_m_jdjs_0009","毁灭巨大僵尸","毁灭巨大僵尸",0.7,"0#-20"]
[null,19034,"live2d_m_kn_0018","毁灭翼魔","毁灭翼魔",0.7,"0#-20"]
[null,19035,"live2d_m_jzkl_0006","毁灭符文骷髅","毁灭符文骷髅",0.7,"0#-20"]
[null,19036,"live2d_m_kl_0007","毁灭魔术骷髅","毁灭魔术骷髅",0.7,"0#-20"]
[null,19037,"live2d_m_lrh_0027","利刃虎","利刃虎",0.7,"0#-20"]
[null,19038,"live2d_m_ys_0028","樱首","樱首",0.7,"0#-20"]
[null,19039,"live2d_m_jdjs_0009","寒水巨大僵尸","寒水巨大僵尸",0.7,"0#-20"]
[null,19040,"live2d_m_sm_0021","蒜头妹","蒜头妹",0.7,"0#-20"]
[null,19041,"live2d_m_gc_0025","寒水棺材","寒水棺材",0.7,"0#-20"]
[null,19042,"live2d_m_sg_0024","寒水烛刑鬼","寒水烛刑鬼",0.7,"0#-20"]
[null,19043,"live2d_m_hyjl_0002","黑狱精灵","黑狱精灵",0.7,"0#-20"]
[null,19044,"live2d_m_hypd_0003","黑狱炮兵","黑狱炮兵",0.7,"0#-20"]
[null,19045,"live2d_m_xyysz_0014","小叶延始祖","小叶延始祖",0.7,"0#-20"]
[null,19046,"live2d_m_xdd_0015","小蛋蛋","小蛋蛋",0.7,"0#-20"]
[null,19047,"live2d_m_syjm_0026","深渊巨魔","创建账号第一场战斗",0.7,"0#-20"]
[null,19048,"live2d_m_gmyl_0030","诡面妖烈","诡面妖烈",0.7,"0#-20"]
[null,19049,"live2d_m_fc_0032","蜂巢","蜂巢",0.7,"0#-20"]
[null,19050,"live2d_m_chsm_0035","赤华蛇魔","赤华蛇魔",0.7,"0#-20"]
[null,19051,"live2d_m_my_0037","猫鼬","猫鼬",0.7,"0#-20"]
[null,19052,"live2d_m_byjy_0038","变异角羊","变异角羊",0.7,"0#-20"]
[null,19053,"live2d_m_ymmj_0040","幽冥墨镜","幽冥墨镜",0.7,"0#-20"]
[null,19054,"live2d_m_xs_0041","雪首","雪首",0.7,"0#-20"]
[null,19055,"live2d_m_hjyl_0043","黄金翼龙","黄金翼龙",0.7,"0#-20"]
[null,19056,"live2d_m_jjdl_0044","金甲地龙","金甲地龙",0.7,"0#-20"]
[null,19057,"live2d_m_mh_0046","冥虎","冥虎",0.7,"0#-20"]
[null,19058,"live2d_m_mg_0047","冥鬼","冥鬼",0.7,"0#-20"]
[null,19059,"live2d_m_djx_0048","独角仙","独角仙",0.7,"0#-20"]
[null,19060,"live2d_huyao","狐妖","狐妖",0.7,"0#-20"]
[null,20001,"r_RareMaterial_flavouring_0001","初级调味品","初级调味品"]
[null,20002,"r_RareMaterial_flavouring_0002","中级调味品","中级调味品"]
[null,20003,"r_RareMaterial_flavouring_0003","高级调味品","高级调味品"]
[null,20004,"r_RareMaterial_flavouring_0004","顶级调味品","顶级调味品"]
[null,20005,"r_Material_ingredients_0005","御水盐岩","御水盐岩"]
[null,20006,"r_Material_ingredients_0007","血蒜瓣","血蒜瓣"]
[null,20007,"r_Material_ingredients_0008","驱邪姜","驱邪姜"]
[null,20008,"r_Material_ingredients_0009","蜂王蜜浆","蜂王蜜浆"]
[null,20009,"r_Material_ingredients_0006","六角杨桃","六角杨桃"]
[null,20010,"r_Material_ingredients_0017","野生二荆条","野生二荆条"]
[null,20011,"r_RareMaterial_flavouring_0005","靛色橄榄油","靛色橄榄油"]
[null,20012,"r_Material_ingredients_0010","黑枫糖浆","黑枫糖浆"]
[null,20013,"r_Material_ingredients_0001","角羊肉","角羊肉"]
[null,20014,"r_Material_ingredients_0002","无名蕨","无名蕨"]
[null,20015,"r_Material_ingredients_0003","小叶延始祖的蛋","小叶延始祖的蛋"]
[null,20016,"r_Material_ingredients_0004","狐熊掌","狐熊掌"]
[null,20017,"r_Material_ingredients_0011","魔王橄榄","魔王橄榄"]
[null,20018,"r_Material_ingredients_0012","彼岸花蕊","彼岸花蕊"]
[null,20019,"r_Material_ingredients_0013","板栗","板栗"]
[null,20020,"r_Material_ingredients_0014","纯白兔腿肉","纯白兔腿肉"]
[null,20021,"r_Material_ingredients_0015","角羊腿","角羊腿"]
[null,20022,"r_Material_ingredients_0016","肉兔兔头","肉兔兔头"]
[null,20023,"r_Material_ingredients_0018","御水生菜","御水生菜"]
[null,20024,"r_Material_ingredients_0019","平原红萝卜","平原红萝卜"]
[null,20025,"r_Material_ingredients_0020","白叶小麦","白叶小麦"]
[null,20026,"r_Material_ingredients_0021","御水苹果","御水苹果"]
[null,20027,"r_Material_ingredients_0023","高山松茸","高山松茸"]
[null,20028,"r_Material_ingredients_0024","沼地口蘑","沼地口蘑"]
[null,20029,"r_Material_ingredients_0025","角羊内脏","角羊内脏"]
[null,20030,"r_Material_ingredients_0026","巨猿肉","巨猿肉"]
[null,20031,"r_Material_ingredients_0027","海岸黄金蟹","海岸黄金蟹"]
[null,20032,"r_Material_ingredients_0028","五彩皮皮虾","五彩皮皮虾"]
[null,21001,"r_Consume_food_0001","血狼宴","血狼宴"]
[null,21002,"r_Consume_food_0002","酸甜七彩蛋","酸甜七彩蛋"]
[null,21003,"r_Consume_food_0003","魔王蕨","魔王蕨"]
[null,21004,"r_Consume_food_0004","蜂王熊掌","蜂王熊掌"]
[null,21005,"r_Consume_food_0005","姜汁彼岸花","姜汁彼岸花"]
[null,21006,"r_Consume_food_0006","板栗兔腿","板栗兔腿"]
[null,21007,"r_Consume_food_0007","手撕角羊腿","手撕角羊腿"]
[null,21008,"r_Consume_food_0008","香辣兔头","香辣兔头"]
[null,21009,"r_Consume_food_0009","酥炸肉丸","酥炸肉丸"]
[null,21010,"r_Consume_food_0010","平原萝卜饼","平原萝卜饼"]
[null,21011,"r_Consume_food_0011","水果蜜饯","水果蜜饯"]
[null,21012,"r_Consume_food_0012","草原菌菇汤","草原菌菇汤"]
[null,21013,"r_Consume_food_0013","羊杂汤","羊杂汤"]
[null,21014,"r_Consume_food_0014","无名大拌菜","无名大拌菜"]
[null,21015,"r_Consume_food_0015","生拌牛肉","生拌牛肉"]
[null,21016,"r_Consume_food_0016","盐焗巨猿肉","盐焗巨猿肉"]
[null,21017,"r_Consume_food_0017","蜜汁烤羊腿","蜜汁烤羊腿"]
[null,21018,"r_Consume_food_0018","烤小土豆","烤小土豆"]
[null,21019,"r_Consume_food_0019","和果子","和果子"]
[null,21020,"r_Consume_food_0020","水晶虾饺","水晶虾饺"]
[null,21021,"r_Consume_food_0021","菌菇浓汤","菌菇浓汤"]
[null,21022,"r_Consume_food_0022","红烧肉","红烧肉"]
[null,21023,"r_Consume_food_0023","照烧鸡肉串","照烧鸡肉串"]
[null,21024,"r_Consume_food_0024","烧鸡","烧鸡"]
[null,21025,"r_Consume_food_0025","宫保鸡丁","宫保鸡丁"]
[null,21026,"r_Consume_food_0026","清蒸大闸蟹","清蒸大闸蟹"]
[null,21027,"r_Consume_food_0027","盐渍秋刀鱼","盐渍秋刀鱼"]
[null,21028,"r_Consume_food_0028","红酒烩羊肉 ","红酒烩羊肉 "]
[null,21029,"r_Consume_food_0029","清蒸鳗鱼","清蒸鳗鱼"]
[null,21030,"r_Consume_food_0030","烤全羊","烤全羊"]
[null,21031,"r_Consume_food_0031","黑暗料理","黑暗料理"]
[null,22001,"m_kl_0007_t1","魔术骷髅","魔术骷髅"]
[null,22002,"m_jy_0004_t1","无名角羊","无名角羊"]
[null,22003,"m_jzkl_0006_t1","烛刃骷髅","烛刃骷髅"]
[null,22004,"m_jyw_0005_t1","无名角羊王","icon"]
[null,22005,"m_hydyg_0001_t1","山寨典狱官","icon"]
[null,22006,"m_fwkl_0010_t1","符文骷髅","icon"]
[null,22007,"m_bahy_0017_t1","彼岸花妖","icon"]
[null,22008,"m_jdjs_0009_t1","巨大僵尸","icon"]
[null,22009,"m_ds_0011_t1","顽皮地鼠","icon"]
[null,22010,"m_rtz_0012_t1","食肉兔","icon"]
[null,22011,"m_djy_0013_t1","巨猿","icon"]
[null,22012,"m_jy_0004_t1","风见角羊","icon"]
[null,22013,"m_fwwb_0016_t1","港口卫兵","icon"]
[null,22014,"m_hwws_0008_t1","港口翼人护卫","icon"]
[null,22015,"m_kn_0018_t1","白叶翼魔","icon"]
[null,22016,"m_wy_0019_t1","白叶亡灵法师","icon"]
[null,22017,"m_mz_0020_t1","白叶爪刃魔","icon"]
[null,22018,"m_jdjs_0009_t1","荆棘巨大僵尸","icon"]
[null,22019,"m_jyw_0005_t1","荆棘角羊王","icon"]
[null,22020,"m_kn_0018_t1","荆棘翼魔","icon"]
[null,22021,"m_dhx_0022_t1","荆棘狐熊","icon"]
[null,22022,"m_gc_0025_t1","荆棘笑面棺材","icon"]
[null,22023,"m_ddk_0023_t1","荆棘独轮刺客","icon"]
[null,22024,"m_sg_0024_t1","荆棘烛刑鬼","icon"]
[null,22025,"m_jyw_0005_t1","御水角羊王","icon"]
[null,22026,"m_kn_0018_t1","御水翼魔","icon"]
[null,22027,"m_dhx_0022_t1","御水狐熊","icon"]
[null,22028,"m_ddk_0023_t1","御水独轮刺客","icon"]
[null,22029,"m_sg_0024_t1","御水烛刑鬼","icon"]
[null,22030,"m_fwwb_0016_t1","御水卫兵","icon"]
[null,22031,"m_jdjs_0009_t1","毁灭巨大僵尸","icon"]
[null,22032,"m_kn_0018_t1","毁灭翼魔","icon"]
[null,22033,"m_jzkl_0006_t1","毁灭符文骷髅","icon"]
[null,22034,"m_kl_0007_t1","毁灭魔术骷髅","icon"]
[null,22035,"m_lrh_0027_t1","利刃虎","icon"]
[null,22036,"m_ys_0028_t1","樱首","icon"]
[null,22037,"m_jdjs_0009_t1","寒水巨大僵尸","icon"]
[null,22038,"m_sm_0021_t1","蒜头妹","icon"]
[null,22039,"m_gc_0025_t1","寒水棺材","icon"]
[null,22040,"m_sg_0024_t1","寒水烛刑鬼","icon"]
[null,22041,"m_hyjl_0002_t1","黑狱精灵","icon"]
[null,22042,"m_hypd_0003_t1","黑狱炮兵","icon"]
[null,22043,"m_xyysz_0014_t1","小叶延始祖","icon"]
[null,22044,"m_xdd_0015_t1","小蛋蛋","icon"]
[null,22045,"m_syjm_0026_t1","深渊巨魔","icon"]
[null,22046,"m_gmyl_0030_t1","诡面妖烈","icon"]
[null,22047,"m_fc_0032_t1","蜂巢","icon"]
[null,22048,"m_chsm_0035_t1","赤华蛇魔","icon"]
[null,22049,"m_my_0037_t1","猫鼬","icon"]
[null,22050,"m_byjy_0038_t1","变异角羊","icon"]
[null,22051,"m_ymmj_0040_t1","幽冥墨镜","icon"]
[null,22052,"m_xs_0041_t1","雪首","icon"]
[null,22053,"m_hjyl_0043_t1","黄金翼龙","icon"]
[null,22054,"m_jjdl_0044_t1","金甲地龙","icon"]
[null,22055,"m_mh_0046_t1","冥虎","icon"]
[null,22056,"m_mg_0047_t1","冥鬼","icon"]
[null,22057,"m_djx_0048_t1","独角仙","icon"]
[null,23001,"r_zjm_zhaomu_001","招募","功能解锁图标"]
[null,23002,"r_zjm_biandui_001","编队","功能解锁图标"]
[null,23003,"r_zjm_yiyao_001","异妖","功能解锁图标"]
[null,23004,"r_zjm_gonghui_001","公会","功能解锁图标"]
[null,23005,"r_fuc_open008","锻造","功能解锁图标"]
[null,23006,null,"百味居","功能解锁图标"]
[null,23007,"r_zjm_mijing_001","秘境","功能解锁图标"]
[null,23008,"r_fuc_open007","竞技场","功能解锁图标"]
[null,23009,null,"汉元之境","功能解锁图标"]
[null,23010,null,"亡魂之海","功能解锁图标"]
[null,23011,null,"综合副本","功能解锁图标"]
[null,23012,"r_fuc_open009","每日任务","功能解锁图标"]
[null,23013,null,"世界boss","功能解锁图标"]
[null,23014,null,"聊天","功能解锁图标"]
[null,23015,"r_zjm_qiridenglv","七日登陆","功能解锁图标"]
[null,23016,null,"在线奖励","功能解锁图标"]
[null,23017,"r_fuc_open004","普通副本","功能解锁图标"]
[null,23018,"r_fuc_open006","精英副本","功能解锁图标"]
[null,23019,"r_zjm_zhangjiejiangli","章节奖励","功能解锁图标"]
[null,23020,"r_zjm_shangdian_001","商店","功能解锁图标"]
[null,23021,"r_zjm_mihe_001","秘盒","功能解锁图标"]
[null,23022,"r_zjm_chengyuan_001","成员","功能解锁图标"]
[null,23023,"r_zjm_cangku_001","仓库","功能解锁图标"]
[null,23024,null,"猎妖师分解","功能解锁图标"]
[null,23025,"r_zjm_haoyou_001","好友","功能解锁图标"]
[null,23026,null,"关卡","功能解锁图标"]
[null,23027,null,"妖精商店","功能解锁图标"]
[null,23028,"r_fuc_open009","日常任务","功能解锁图标"]
[null,23029,"r_zjm_haoyou_001","主角","功能解锁图标"]
[null,23030,null,"天赋树","功能解锁图标"]
[null,23031,null,"武器打造","功能解锁图标"]
[null,23032,null,"防具打造","功能解锁图标"]
[null,23033,null,"装备重铸","功能解锁图标"]
[null,23034,null,"试炼","功能解锁图标"]
[null,23035,null,"冒险","功能解锁图标"]
[null,23036,null,"红尘往事","功能解锁图标"]
[null,23037,"r_zjm_zhaomu_003","招募文字","功能解锁图标"]
[null,23038,"r_zjm_mijing_003","秘境文字","功能解锁图标"]
[null,23039,"r_zjm_shangdian_003","商店文字","功能解锁图标"]
[null,23040,"r_zjm_mihe_003","秘盒文字","功能解锁图标"]
[null,23041,"r_zjm_zhujue","主角文字","功能解锁图标"]
[null,23042,"r_zjm_haoyou_003","好友文字","功能解锁图标"]
[null,23043,"r_zjm_gonghui_003","公会文字","功能解锁图标"]
[null,23044,"r_zjm_gonghuishilian","公会试炼","功能解锁图标"]
[null,23045,"r_zjm_danaotiangong","猎妖之路","功能解锁图标"]
[null,201011,"s_syf_0016_tap","凌甲","凌甲"]
[null,201012,"s_syf_0016_tap","凌甲","凌甲"]
[null,201013,"s_syf_0016_tap","凌甲","凌甲"]
[null,201014,"s_syf_0016_tap","凌甲","凌甲"]
[null,201015,"s_syf_0016_tap","凌甲","凌甲"]
[null,201021,"s_syf_0016_slide","震岳","震岳"]
[null,201022,"s_syf_0016_slide","震岳","震岳"]
[null,201023,"s_syf_0016_slide","震岳","震岳"]
[null,201024,"s_syf_0016_slide","震岳","震岳"]
[null,201025,"s_syf_0016_slide","震岳","震岳"]
[null,{"$f":"B1148+1000","v":202011},"s_ch_0015_tap","啸牙","啸牙"]
[null,202012,"s_ch_0015_tap","啸牙","啸牙"]
[null,202013,"s_ch_0015_tap","啸牙","啸牙"]
[null,202014,"s_ch_0015_tap","啸牙","啸牙"]
[null,202015,"s_ch_0015_tap","啸牙","啸牙"]
[null,202021,"s_ch_0015_slide","白虎风涛","白虎风涛"]
[null,202022,"s_ch_0015_slide","白虎风涛","白虎风涛"]
[null,202023,"s_ch_0015_slide","白虎风涛","白虎风涛"]
[null,202024,"s_ch_0015_slide","白虎风涛","白虎风涛"]
[null,202025,"s_ch_0015_slide","白虎风涛","白虎风涛"]
[null,203011,"s_xhht_0017_tap","断鸿","断鸿"]
[null,203012,"s_xhht_0017_tap","断鸿","断鸿"]
[null,203013,"s_xhht_0017_tap","断鸿","断鸿"]
[null,203014,"s_xhht_0017_tap","断鸿","断鸿"]
[null,203015,"s_xhht_0017_tap","断鸿","断鸿"]
[null,203021,"s_xhht_0017_slide","裂山贯云","裂山贯云"]
[null,203022,"s_xhht_0017_slide","裂山贯云","裂山贯云"]
[null,203023,"s_xhht_0017_slide","裂山贯云","裂山贯云"]
[null,203024,"s_xhht_0017_slide","裂山贯云","裂山贯云"]
[null,203025,"s_xhht_0017_slide","裂山贯云","裂山贯云"]
[null,204011,"s_yr_0007_tap","轻流","轻流"]
[null,204012,"s_yr_0007_tap","轻流","轻流"]
[null,204013,"s_yr_0007_tap","轻流","轻流"]
[null,204014,"s_yr_0007_tap","轻流","轻流"]
[null,204015,"s_yr_0007_tap","轻流","轻流"]
[null,204021,"s_yr_0007_slide","天咏诀","天咏诀"]
[null,204022,"s_yr_0007_slide","天咏诀","天咏诀"]
[null,204023,"s_yr_0007_slide","天咏诀","天咏诀"]
[null,204024,"s_yr_0007_slide","天咏诀","天咏诀"]
[null,204025,"s_yr_0007_slide","天咏诀","天咏诀"]
[null,205011,"s_dmk_0043_tap","长槐琼灯","长槐琼灯"]
[null,205012,"s_dmk_0043_tap","长槐琼灯","长槐琼灯"]
[null,{"$f":"B1180+1000","v":205013},"s_dmk_0043_tap","长槐琼灯","长槐琼灯"]
[null,205014,"s_dmk_0043_tap","长槐琼灯","长槐琼灯"]
[null,205015,"s_dmk_0043_tap","长槐琼灯","长槐琼灯"]
[null,205021,"s_dmk_0043_slide","百卉含英","百卉含英"]
[null,205022,"s_dmk_0043_slide","百卉含英","百卉含英"]
[null,205023,"s_dmk_0043_slide","百卉含英","百卉含英"]
[null,205024,"s_dmk_0043_slide","百卉含英","百卉含英"]
[null,205025,"s_dmk_0043_slide","百卉含英","百卉含英"]
[null,206011,"s_qlq_0006_tap","阳炎破阵曲","阳炎破阵曲"]
[null,206012,"s_qlq_0006_tap","阳炎破阵曲","阳炎破阵曲"]
[null,206013,"s_qlq_0006_tap","阳炎破阵曲","阳炎破阵曲"]
[null,206014,"s_qlq_0006_tap","阳炎破阵曲","阳炎破阵曲"]
[null,206015,"s_qlq_0006_tap","阳炎破阵曲","阳炎破阵曲"]
[null,206021,"s_qlq_0006_slide","焚心引","焚心引"]
[null,206022,"s_qlq_0006_slide","焚心引","焚心引"]
[null,206023,"s_qlq_0006_slide","焚心引","焚心引"]
[null,206024,"s_qlq_0006_slide","焚心引","焚心引"]
[null,206025,"s_qlq_0006_slide","焚心引","焚心引"]
[null,207011,"s_ly_0039_tap","破甲裂","破甲裂"]
[null,207012,"s_jz_0002_tap","破甲裂","破甲裂"]
[null,207013,"s_jz_0002_tap","破甲裂","破甲裂"]
[null,207014,"s_jz_0002_tap","破甲裂","破甲裂"]
[null,207015,"s_jz_0002_tap","破甲裂","破甲裂"]
[null,207021,"s_ly_0039_slide","轮转之海","轮转之海"]
[null,207022,"s_jz_0002_slide","轮转之海","轮转之海"]
[null,207023,"s_jz_0002_slide","轮转之海","轮转之海"]
[null,207024,"s_jz_0002_slide","轮转之海","轮转之海"]
[null,207025,"s_jz_0002_slide","轮转之海","轮转之海"]
[null,208011,"s_bmf_0004_tap","幻境之瞳","幻境之瞳"]
[null,208012,"s_bmf_0004_tap","幻境之瞳","幻境之瞳"]
[null,208013,"s_bmf_0004_tap","幻境之瞳","幻境之瞳"]
[null,208014,"s_bmf_0004_tap","幻境之瞳","幻境之瞳"]
[null,{"$f":"B1212+1000","v":208015},"s_bmf_0004_tap","幻境之瞳","幻境之瞳"]
[null,{"$f":"B1213+1000","v":208021},"s_bmf_0004_slide","无尽莲塘","无尽莲塘"]
[null,208022,"s_bmf_0004_slide","无尽莲塘","无尽莲塘"]
[null,208023,"s_bmf_0004_slide","无尽莲塘","无尽莲塘"]
[null,208024,"s_bmf_0004_slide","无尽莲塘","无尽莲塘"]
[null,208025,"s_bmf_0004_slide","无尽莲塘","无尽莲塘"]
[null,209011,"s_qf_0046_tap","黑符","黑符"]
[null,209012,"s_qf_0046_tap","黑符","黑符"]
[null,209013,"s_qf_0046_tap","黑符","黑符"]
[null,209014,"s_qf_0046_tap","黑符","黑符"]
[null,209015,"s_qf_0046_tap","黑符","黑符"]
[null,209021,"s_qf_0046_slide","炎冥锁狱","炎冥锁狱"]
[null,209022,"s_qf_0046_slide","炎冥锁狱","炎冥锁狱"]
[null,209023,"s_qf_0046_slide","炎冥锁狱","炎冥锁狱"]
[null,209024,"s_qf_0046_slide","炎冥锁狱","炎冥锁狱"]
[null,209025,"s_qf_0046_slide","炎冥锁狱","炎冥锁狱"]
[null,210011,"s_yqj_0042_tap","涡流","涡流"]
[null,210012,"s_yqj_0042_tap","涡流","涡流"]
[null,210013,"s_yqj_0042_tap","涡流","涡流"]
[null,210014,"s_yqj_0042_tap","涡流","涡流"]
[null,210015,"s_yqj_0042_tap","涡流","涡流"]
[null,210021,"s_yqj_0042_slide","龙兴之潮","龙兴之潮"]
[null,210022,"s_yqj_0042_slide","龙兴之潮","龙兴之潮"]
[null,210023,"s_yqj_0042_slide","龙兴之潮","龙兴之潮"]
[null,210024,"s_yqj_0042_slide","龙兴之潮","龙兴之潮"]
[null,210025,"s_yqj_0042_slide","龙兴之潮","龙兴之潮"]
[null,211011,"s_yy_0041_tap","地灵咒","地灵咒"]
[null,211012,"s_yy_0041_tap","地灵咒","地灵咒"]
[null,211013,"s_yy_0041_tap","地灵咒","地灵咒"]
[null,211014,"s_yy_0041_tap","地灵咒","地灵咒"]
[null,211015,"s_yy_0041_tap","地灵咒","地灵咒"]
[null,211021,"s_yy_0041_slide","缚傀诀","缚傀诀"]
[null,211022,"s_yy_0041_slide","缚傀诀","缚傀诀"]
[null,211023,"s_yy_0041_slide","缚傀诀","缚傀诀"]
[null,211024,"s_yy_0041_slide","缚傀诀","缚傀诀"]
[null,211025,"s_yy_0041_slide","缚傀诀","缚傀诀"]
[null,212011,"s_mrzq_0010_tap","焚花","焚花"]
[null,212012,"s_mrzq_0010_tap","焚花","焚花"]
[null,212013,"s_mrzq_0010_tap","焚花","焚花"]
[null,212014,"s_mrzq_0010_tap","焚花","焚花"]
[null,212015,"s_mrzq_0010_tap","焚花","焚花"]
[null,212021,"s_mrzq_0010_slide","断雨","断雨"]
[null,212022,"s_mrzq_0010_slide","断雨","断雨"]
[null,212023,"s_mrzq_0010_slide","断雨","断雨"]
[null,212024,"s_mrzq_0010_slide","断雨","断雨"]
[null,212025,"s_mrzq_0010_slide","断雨","断雨"]
[null,213011,"s_yl_0014_tap","黑泉利箭","黑泉利箭"]
[null,213012,"s_yl_0014_tap","黑泉利箭","黑泉利箭"]
[null,213013,"s_yl_0014_tap","黑泉利箭","黑泉利箭"]
[null,213014,"s_yl_0014_tap","黑泉利箭","黑泉利箭"]
[null,213015,"s_yl_0014_tap","黑泉利箭","黑泉利箭"]
[null,213021,"s_yl_0014_slide","芙蓉箭雨","芙蓉箭雨"]
[null,213022,"s_yl_0014_slide","芙蓉箭雨","芙蓉箭雨"]
[null,213023,"s_yl_0014_slide","芙蓉箭雨","芙蓉箭雨"]
[null,213024,"s_yl_0014_slide","芙蓉箭雨","芙蓉箭雨"]
[null,213025,"s_yl_0014_slide","芙蓉箭雨","芙蓉箭雨"]
[null,214011,"s_gt_0001_tap","墨意","墨意"]
[null,214012,"s_gt_0001_tap","墨意","墨意"]
[null,214013,"s_gt_0001_tap","墨意","墨意"]
[null,214014,"s_gt_0001_tap","墨意","墨意"]
[null,214015,"s_gt_0001_tap","墨意","墨意"]
[null,214021,"s_gt_0001_slide","画龙点睛","画龙点睛"]
[null,214022,"s_gt_0001_slide","画龙点睛","画龙点睛"]
[null,214023,"s_gt_0001_slide","画龙点睛","画龙点睛"]
[null,214024,"s_gt_0001_slide","画龙点睛","画龙点睛"]
[null,{"$f":"B1277+1000","v":214025},"s_gt_0001_slide","画龙点睛","画龙点睛"]
[null,215011,"s_xy_0012_tap","辉映","辉映"]
[null,215012,"s_xy_0012_tap","辉映","辉映"]
[null,215013,"s_xy_0012_tap","辉映","辉映"]
[null,215014,"s_xy_0012_tap","辉映","辉映"]
[null,215015,"s_xy_0012_tap","辉映","辉映"]
[null,215021,"s_xy_0012_slide","幻影预兆","幻影预兆"]
[null,215022,"s_xy_0012_slide","幻影预兆","幻影预兆"]
[null,215023,"s_xy_0012_slide","幻影预兆","幻影预兆"]
[null,215024,"s_xy_0012_slide","幻影预兆","幻影预兆"]
[null,215025,"s_xy_0012_slide","幻影预兆","幻影预兆"]
[null,216011,"s_cyh_0008_tap","无明火","无明火"]
[null,216012,"s_cyh_0008_tap","无明火","无明火"]
[null,216013,"s_cyh_0008_tap","无明火","无明火"]
[null,216014,"s_cyh_0008_tap","无明火","无明火"]
[null,216015,"s_cyh_0008_tap","无明火","无明火"]
[null,216021,"s_cyh_0008_slide","禁焰觉醒","禁焰觉醒"]
[null,216022,"s_cyh_0008_slide","禁焰觉醒","禁焰觉醒"]
[null,216023,"s_cyh_0008_slide","禁焰觉醒","禁焰觉醒"]
[null,216024,"s_cyh_0008_slide","禁焰觉醒","禁焰觉醒"]
[null,216025,"s_cyh_0008_slide","禁焰觉醒","禁焰觉醒"]
[null,217011,"s_sxdw_0053_tap","晦影","晦影"]
[null,217012,"s_sxdw_0053_tap","晦影","晦影"]
[null,217013,"s_sxdw_0053_tap","晦影","晦影"]
[null,217014,"s_sxdw_0053_tap","晦影","晦影"]
[null,217015,"s_sxdw_0053_tap","晦影","晦影"]
[null,217021,"s_sxdw_0053_slide","常世之暗","常世之暗"]
[null,217022,"s_sxdw_0053_slide","常世之暗","常世之暗"]
[null,217023,"s_sxdw_0053_slide","常世之暗","常世之暗"]
[null,217024,"s_sxdw_0053_slide","常世之暗","常世之暗"]
[null,217025,"s_sxdw_0053_slide","常世之暗","常世之暗"]
[null,218011,"s_zh_0044_tap","天照","天照"]
[null,218012,"s_zh_0044_tap","天照","天照"]
[null,218013,"s_zh_0044_tap","天照","天照"]
[null,218014,"s_zh_0044_tap","天照","天照"]
[null,218015,"s_zh_0044_tap","天照","天照"]
[null,218021,"s_zh_0044_slide","剜心刺骨","剜心刺骨"]
[null,218022,"s_zh_0044_slide","剜心刺骨","剜心刺骨"]
[null,218023,"s_zh_0044_slide","剜心刺骨","剜心刺骨"]
[null,218024,"s_zh_0044_slide","剜心刺骨","剜心刺骨"]
[null,218025,"s_zh_0044_slide","剜心刺骨","剜心刺骨"]
[null,219011,"s_kq_0018_tap","辰变","辰变"]
[null,219012,"s_kq_0018_tap","辰变","辰变"]
[null,219013,"s_kq_0018_tap","辰变","辰变"]
[null,219014,"s_kq_0018_tap","辰变","辰变"]
[null,219015,"s_kq_0018_tap","辰变","辰变"]
[null,219021,"s_kq_0018_slide","凭虚御风","凭虚御风"]
[null,219022,"s_kq_0018_slide","凭虚御风","凭虚御风"]
[null,219023,"s_kq_0018_slide","凭虚御风","凭虚御风"]
[null,219024,"s_kq_0018_slide","凭虚御风","凭虚御风"]
[null,219025,"s_kq_0018_slide","凭虚御风","凭虚御风"]
[null,220011,"s_ywy_0040_tap","天回","天回"]
[null,220012,"s_ywy_0040_tap","天回","天回"]
[null,220013,"s_ywy_0040_tap","天回","天回"]
[null,220014,"s_ywy_0040_tap","天回","天回"]
[null,220015,"s_ywy_0040_tap","天回","天回"]
[null,220021,"s_ywy_0040_slide","白炎离火","白炎离火"]
[null,220022,"s_ywy_0040_slide","白炎离火","白炎离火"]
[null,220023,"s_ywy_0040_slide","白炎离火","白炎离火"]
[null,220024,"s_ywy_0040_slide","白炎离火","白炎离火"]
[null,220025,"s_ywy_0040_slide","白炎离火","白炎离火"]
[null,221011,"s_mlmn_0054_tap","水玉缚灵","水玉缚灵"]
[null,221012,"s_mlmn_0054_tap","水玉缚灵","水玉缚灵"]
[null,221013,"s_mlmn_0054_tap","水玉缚灵","水玉缚灵"]
[null,{"$f":"B1341+1000","v":221014},"s_mlmn_0054_tap","水玉缚灵","水玉缚灵"]
[null,221015,"s_mlmn_0054_tap","水玉缚灵","水玉缚灵"]
[null,221021,"s_mlmn_0054_slide","深渊流葬","深渊流葬"]
[null,221022,"s_mlmn_0054_slide","深渊流葬","深渊流葬"]
[null,221023,"s_mlmn_0054_slide","深渊流葬","深渊流葬"]
[null,221024,"s_mlmn_0054_slide","深渊流葬","深渊流葬"]
[null,221025,"s_mlmn_0054_slide","深渊流葬","深渊流葬"]
[null,222011,"s_ywg_0045_tap","煞气","煞气"]
[null,222012,"s_ywg_0045_tap","煞气","煞气"]
[null,222013,"s_ywg_0045_tap","煞气","煞气"]
[null,222014,"s_ywg_0045_tap","煞气","煞气"]
[null,222015,"s_ywg_0045_tap","煞气","煞气"]
[null,222021,"s_ywg_0045_slide","侵风摧魂","侵风摧魂"]
[null,222022,"s_ywg_0045_slide","侵风摧魂","侵风摧魂"]
[null,222023,"s_ywg_0045_slide","侵风摧魂","侵风摧魂"]
[null,222024,"s_ywg_0045_slide","侵风摧魂","侵风摧魂"]
[null,222025,"s_ywg_0045_slide","侵风摧魂","侵风摧魂"]
[null,223011,"s_y_0013_tap","雷罚","雷罚"]
[null,223012,"s_y_0013_tap","雷罚","雷罚"]
[null,223013,"s_y_0013_tap","雷罚","雷罚"]
[null,223014,"s_y_0013_tap","雷罚","雷罚"]
[null,223015,"s_y_0013_tap","雷罚","雷罚"]
[null,223021,"s_y_0013_slide","苍穹天雷","苍穹天雷"]
[null,223022,"s_y_0013_slide","苍穹天雷","苍穹天雷"]
[null,223023,"s_y_0013_slide","苍穹天雷","苍穹天雷"]
[null,223024,"s_y_0013_slide","苍穹天雷","苍穹天雷"]
[null,223025,"s_y_0013_slide","苍穹天雷","苍穹天雷"]
[null,224011,"s_ly_0070_tap","狂风","狂风"]
[null,224012,"s_xjr_0003_tap","狂风","狂风"]
[null,224013,"s_xjr_0003_tap","狂风","狂风"]
[null,224014,"s_xjr_0003_tap","狂风","狂风"]
[null,224015,"s_xjr_0003_tap","狂风","狂风"]
[null,224021,"s_ly_0070_slide","风烈打","风烈打"]
[null,224022,"s_xjr_0003_slide","风烈打","风烈打"]
[null,224023,"s_xjr_0003_slide","风烈打","风烈打"]
[null,224024,"s_xjr_0003_slide","风烈打","风烈打"]
[null,224025,"s_xjr_0003_slide","风烈打","风烈打"]
[null,225011,"s_tx_0011_tap","烈焰拳","烈焰拳"]
[null,225012,"s_tx_0011_tap","烈焰拳","烈焰拳"]
[null,225013,"s_tx_0011_tap","烈焰拳","烈焰拳"]
[null,225014,"s_tx_0011_tap","烈焰拳","烈焰拳"]
[null,225015,"s_tx_0011_tap","烈焰拳","烈焰拳"]
[null,225021,"s_tx_0011_slide","宣火符","宣火符"]
[null,225022,"s_tx_0011_slide","宣火符","宣火符"]
[null,225023,"s_tx_0011_slide","宣火符","宣火符"]
[null,225024,"s_tx_0011_slide","宣火符","宣火符"]
[null,225025,"s_tx_0011_slide","宣火符","宣火符"]
[null,226011,"s_sq_0019_tap","敲山震虎","敲山震虎"]
[null,226012,"s_sq_0019_tap","敲山震虎","敲山震虎"]
[null,226013,"s_sq_0019_tap","敲山震虎","敲山震虎"]
[null,226014,"s_sq_0019_tap","敲山震虎","敲山震虎"]
[null,226015,"s_sq_0019_tap","敲山震虎","敲山震虎"]
[null,226021,"s_sq_0019_slide","崩雷式","崩雷式"]
[null,226022,"s_sq_0019_slide","崩雷式","崩雷式"]
[null,226023,"s_sq_0019_slide","崩雷式","崩雷式"]
[null,226024,"s_sq_0019_slide","崩雷式","崩雷式"]
[null,226025,"s_sq_0019_slide","崩雷式","崩雷式"]
[null,227011,"s_nye_0020_tap","应援","应援"]
[null,227012,"s_nye_0020_tap","应援","应援"]
[null,227013,"s_nye_0020_tap","应援","应援"]
[null,227014,"s_nye_0020_tap","应援","应援"]
[null,227015,"s_nye_0020_tap","应援","应援"]
[null,227021,"s_nye_0020_slide","兔兔拳","兔兔拳"]
[null,227022,"s_nye_0020_slide","兔兔拳","兔兔拳"]
[null,{"$f":"B1405+1000","v":227023},"s_nye_0020_slide","兔兔拳","兔兔拳"]
[null,227024,"s_nye_0020_slide","兔兔拳","兔兔拳"]
[null,227025,"s_nye_0020_slide","兔兔拳","兔兔拳"]
[null,228011,"s_zc_0021_tap","落英之舞","落英之舞"]
[null,228012,"s_zc_0021_tap","落英之舞","落英之舞"]
[null,228013,"s_zc_0021_tap","落英之舞","落英之舞"]
[null,228014,"s_zc_0021_tap","落英之舞","落英之舞"]
[null,228015,"s_zc_0021_tap","落英之舞","落英之舞"]
[null,228021,"s_zc_0021_slide","月舞灵息","月舞灵息"]
[null,228022,"s_zc_0021_slide","月舞灵息","月舞灵息"]
[null,228023,"s_zc_0021_slide","月舞灵息","月舞灵息"]
[null,228024,"s_zc_0021_slide","月舞灵息","月舞灵息"]
[null,228025,"s_zc_0021_slide","月舞灵息","月舞灵息"]
[null,229011,"s_lhmn_0056_tap","花开一瞬","花开一瞬"]
[null,229012,"s_lhmn_0056_tap","花开一瞬","花开一瞬"]
[null,229013,"s_lhmn_0056_tap","花开一瞬","花开一瞬"]
[null,229014,"s_lhmn_0056_tap","花开一瞬","花开一瞬"]
[null,229015,"s_lhmn_0056_tap","花开一瞬","花开一瞬"]
[null,229021,"s_lhmn_0056_slide","昙华动地","昙华动地"]
[null,229022,"s_lhmn_0056_slide","昙华动地","昙华动地"]
[null,229023,"s_lhmn_0056_slide","昙华动地","昙华动地"]
[null,229024,"s_lhmn_0056_slide","昙华动地","昙华动地"]
[null,229025,"s_lhmn_0056_slide","昙华动地","昙华动地"]
[null,230011,"s_yy_0023_tap","清风","清风"]
[null,230012,"s_yy_0023_tap","清风","清风"]
[null,230013,"s_yy_0023_tap","清风","清风"]
[null,230014,"s_yy_0023_tap","清风","清风"]
[null,230015,"s_yy_0023_tap","清风","清风"]
[null,230021,"s_yy_0023_slide","碧砂","碧砂"]
[null,230022,"s_yy_0023_slide","碧砂","碧砂"]
[null,230023,"s_yy_0023_slide","碧砂","碧砂"]
[null,230024,"s_yy_0023_slide","碧砂","碧砂"]
[null,230025,"s_yy_0023_slide","碧砂","碧砂"]
[null,{"$f":"B1438+1000","v":231011},"s_jpw_0024_tap","诸邪退散","诸邪退散"]
[null,231012,"s_jpw_0024_tap","诸邪退散","诸邪退散"]
[null,231013,"s_jpw_0024_tap","诸邪退散","诸邪退散"]
[null,231014,"s_jpw_0024_tap","诸邪退散","诸邪退散"]
[null,231015,"s_jpw_0024_tap","诸邪退散","诸邪退散"]
[null,231021,"s_jpw_0024_slide","破邪二连","破邪二连"]
[null,231022,"s_jpw_0024_slide","破邪二连","破邪二连"]
[null,231023,"s_jpw_0024_slide","破邪二连","破邪二连"]
[null,231024,"s_jpw_0024_slide","破邪二连","破邪二连"]
[null,231025,"s_jpw_0024_slide","破邪二连","破邪二连"]
[null,232011,"s_ly_0025_tap","地龙破","地龙破"]
[null,232012,"s_ly_0025_tap","地龙破","地龙破"]
[null,232013,"s_ly_0025_tap","地龙破","地龙破"]
[null,232014,"s_ly_0025_tap","地龙破","地龙破"]
[null,232015,"s_ly_0025_tap","地龙破","地龙破"]
[null,232021,"s_ly_0025_slide","天雷地火","天雷地火"]
[null,232022,"s_ly_0025_slide","天雷地火","天雷地火"]
[null,232023,"s_ly_0025_slide","天雷地火","天雷地火"]
[null,232024,"s_ly_0025_slide","天雷地火","天雷地火"]
[null,232025,"s_ly_0025_slide","天雷地火","天雷地火"]
[null,233011,"s_xy_0026_tap","地煞","地煞"]
[null,233012,"s_xy_0026_tap","地煞","地煞"]
[null,233013,"s_xy_0026_tap","地煞","地煞"]
[null,233014,"s_xy_0026_tap","地煞","地煞"]
[null,233015,"s_xy_0026_tap","地煞","地煞"]
[null,233021,"s_xy_0026_slide","隐遁","隐遁"]
[null,233022,"s_xy_0026_slide","隐遁","隐遁"]
[null,233023,"s_xy_0026_slide","隐遁","隐遁"]
[null,233024,"s_xy_0026_slide","隐遁","隐遁"]
[null,233025,"s_xy_0026_slide","隐遁","隐遁"]
[null,234011,"s_fm_0027_tap","辟魂","辟魂"]
[null,234012,"s_fm_0027_tap","辟魂","辟魂"]
[null,{"$f":"B1470+1000","v":234013},"s_fm_0027_tap","辟魂","辟魂"]
[null,234014,"s_fm_0027_tap","辟魂","辟魂"]
[null,234015,"s_fm_0027_tap","辟魂","辟魂"]
[null,234021,"s_fm_0027_slide","夺形之雾","夺形之雾"]
[null,234022,"s_fm_0027_slide","夺形之雾","夺形之雾"]
[null,234023,"s_fm_0027_slide","夺形之雾","夺形之雾"]
[null,234024,"s_fm_0027_slide","夺形之雾","夺形之雾"]
[null,234025,"s_fm_0027_slide","夺形之雾","夺形之雾"]
[null,235011,"s_skr_0028_tap","血影迷踪","血影迷踪"]
[null,235012,"s_skr_0028_tap","血影迷踪","血影迷踪"]
[null,235013,"s_skr_0028_tap","血影迷踪","血影迷踪"]
[null,235014,"s_skr_0028_tap","血影迷踪","血影迷踪"]
[null,235015,"s_skr_0028_tap","血影迷踪","血影迷踪"]
[null,235021,"s_skr_0028_slide","沥血诛心","沥血诛心"]
[null,235022,"s_skr_0028_slide","沥血诛心","沥血诛心"]
[null,235023,"s_skr_0028_slide","沥血诛心","沥血诛心"]
[null,235024,"s_skr_0028_slide","沥血诛心","沥血诛心"]
[null,235025,"s_skr_0028_slide","沥血诛心","沥血诛心"]
[null,236011,"s_jy_0029_tap","星海回流","星海回流"]
[null,236012,"s_jy_0029_tap","星海回流","星海回流"]
[null,236013,"s_jy_0029_tap","星海回流","星海回流"]
[null,236014,"s_jy_0029_tap","星海回流","星海回流"]
[null,236015,"s_jy_0029_tap","星海回流","星海回流"]
[null,236021,"s_jy_0029_slide","深海冥灵","深海冥灵"]
[null,236022,"s_jy_0029_slide","深海冥灵","深海冥灵"]
[null,236023,"s_jy_0029_slide","深海冥灵","深海冥灵"]
[null,236024,"s_jy_0029_slide","深海冥灵","深海冥灵"]
[null,236025,"s_jy_0029_slide","深海冥灵","深海冥灵"]
[null,237011,"s_xl_0030_tap","秋水无痕","秋水无痕"]
[null,237012,"s_xl_0030_tap","秋水无痕","秋水无痕"]
[null,237013,"s_xl_0030_tap","秋水无痕","秋水无痕"]
[null,237014,"s_xl_0030_tap","秋水无痕","秋水无痕"]
[null,{"$f":"B1502+1000","v":237015},"s_xl_0030_tap","秋水无痕","秋水无痕"]
[null,237021,"s_xl_0030_slide","凝霜箭","凝霜箭"]
[null,237022,"s_xl_0030_slide","凝霜箭","凝霜箭"]
[null,237023,"s_xl_0030_slide","凝霜箭","凝霜箭"]
[null,237024,"s_xl_0030_slide","凝霜箭","凝霜箭"]
[null,237025,"s_xl_0030_slide","凝霜箭","凝霜箭"]
[null,238011,"s_cs_0031_tap","业火红莲","业火红莲"]
[null,238012,"s_cs_0031_tap","业火红莲","业火红莲"]
[null,238013,"s_cs_0031_tap","业火红莲","业火红莲"]
[null,238014,"s_cs_0031_tap","业火红莲","业火红莲"]
[null,238015,"s_cs_0031_tap","业火红莲","业火红莲"]
[null,238021,"s_cs_0031_slide","火相炎流","火相炎流"]
[null,238022,"s_cs_0031_slide","火相炎流","火相炎流"]
[null,238023,"s_cs_0031_slide","火相炎流","火相炎流"]
[null,238024,"s_cs_0031_slide","火相炎流","火相炎流"]
[null,238025,"s_cs_0031_slide","火相炎流","火相炎流"]
[null,239011,"s_qr_0065_tap","分水斩","分水斩"]
[null,239012,"s_qr_0065_tap","分水斩","分水斩"]
[null,239013,"s_qr_0065_tap","分水斩","分水斩"]
[null,239014,"s_qr_0065_tap","分水斩","分水斩"]
[null,239015,"s_qr_0065_tap","分水斩","分水斩"]
[null,239021,"s_qr_0065_slide","寒芒刺","寒芒刺"]
[null,239022,"s_qr_0065_slide","寒芒刺","寒芒刺"]
[null,239023,"s_qr_0065_slide","寒芒刺","寒芒刺"]
[null,239024,"s_qr_0065_slide","寒芒刺","寒芒刺"]
[null,239025,"s_qr_0065_slide","寒芒刺","寒芒刺"]
[null,240011,"s_rj_0033_tap","炎龙破","炎龙破"]
[null,240012,"s_rj_0033_tap","炎龙破","炎龙破"]
[null,240013,"s_rj_0033_tap","炎龙破","炎龙破"]
[null,240014,"s_rj_0033_tap","炎龙破","炎龙破"]
[null,240015,"s_rj_0033_tap","炎龙破","炎龙破"]
[null,240021,"s_rj_0033_slide","煌炎斩","煌炎斩"]
[null,{"$f":"B1534+1000","v":240022},"s_rj_0033_slide","煌炎斩","煌炎斩"]
[null,240023,"s_rj_0033_slide","煌炎斩","煌炎斩"]
[null,240024,"s_rj_0033_slide","煌炎斩","煌炎斩"]
[null,240025,"s_rj_0033_slide","煌炎斩","煌炎斩"]
[null,241011,"s_mc_0034_tap","炎击","炎击"]
[null,241012,"s_mc_0034_tap","炎击","炎击"]
[null,241013,"s_mc_0034_tap","炎击","炎击"]
[null,241014,"s_mc_0034_tap","炎击","炎击"]
[null,241015,"s_mc_0034_tap","炎击","炎击"]
[null,241021,"s_mc_0034_slide","烈虎归山","烈虎归山"]
[null,241022,"s_mc_0034_slide","烈虎归山","烈虎归山"]
[null,241023,"s_mc_0034_slide","烈虎归山","烈虎归山"]
[null,241024,"s_mc_0034_slide","烈虎归山","烈虎归山"]
[null,{"$f":"B1547+1000","v":241025},"s_mc_0034_slide","烈虎归山","烈虎归山"]
[null,242011,"s_yl_0035_tap","寻鹰剑","寻鹰剑"]
[null,242012,"s_yl_0035_tap","寻鹰剑","寻鹰剑"]
[null,242013,"s_yl_0035_tap","寻鹰剑","寻鹰剑"]
[null,242014,"s_yl_0035_tap","寻鹰剑","寻鹰剑"]
[null,242015,"s_yl_0035_tap","寻鹰剑","寻鹰剑"]
[null,242021,"s_yl_0035_slide","惊风斩","惊风斩"]
[null,242022,"s_yl_0035_slide","惊风斩","惊风斩"]
[null,242023,"s_yl_0035_slide","惊风斩","惊风斩"]
[null,242024,"s_yl_0035_slide","惊风斩","惊风斩"]
[null,242025,"s_yl_0035_slide","惊风斩","惊风斩"]
[null,243011,"s_wl_0036_tap","水剑","水剑"]
[null,243012,"s_wl_0036_tap","水剑","水剑"]
[null,243013,"s_wl_0036_tap","水剑","水剑"]
[null,243014,"s_wl_0036_tap","水剑","水剑"]
[null,243015,"s_wl_0036_tap","水剑","水剑"]
[null,243021,"s_wl_0036_slide","侵染之刃","侵染之刃"]
[null,243022,"s_wl_0036_slide","侵染之刃","侵染之刃"]
[null,243023,"s_wl_0036_slide","侵染之刃","侵染之刃"]
[null,243024,"s_wl_0036_slide","侵染之刃","侵染之刃"]
[null,243025,"s_wl_0036_slide","侵染之刃","侵染之刃"]
[null,244011,"s_fjzd_0055_tap","绝息","绝息"]
[null,244012,"s_fjzd_0055_tap","绝息","绝息"]
[null,244013,"s_fjzd_0055_tap","绝息","绝息"]
[null,244014,"s_fjzd_0055_tap","绝息","绝息"]
[null,244015,"s_fjzd_0055_tap","绝息","绝息"]
[null,244021,"s_fjzd_0055_slide","化灵灭影","化灵灭影"]
[null,244022,"s_fjzd_0055_slide","化灵灭影","化灵灭影"]
[null,244023,"s_fjzd_0055_slide","化灵灭影","化灵灭影"]
[null,244024,"s_fjzd_0055_slide","化灵灭影","化灵灭影"]
[null,244025,"s_fjzd_0055_slide","化灵灭影","化灵灭影"]
[null,245011,"s_sk_0038_tap","风神","风神"]
[null,245012,"s_sk_0038_tap","风神","风神"]
[null,245013,"s_sk_0038_tap","风神","风神"]
[null,245014,"s_sk_0038_tap","风神","风神"]
[null,245015,"s_sk_0038_tap","风神","风神"]
[null,245021,"s_sk_0038_slide","援应","援应"]
[null,245022,"s_sk_0038_slide","援应","援应"]
[null,245023,"s_sk_0038_slide","援应","援应"]
[null,245024,"s_sk_0038_slide","援应","援应"]
[null,245025,"s_sk_0038_slide","援应","援应"]
[null,246011,"s_jz_0002_tap","光元刃","光元刃"]
[null,246012,"s_ly_0039_tap","光元刃","光元刃"]
[null,246013,"s_ly_0039_tap","光元刃","光元刃"]
[null,246014,"s_ly_0039_tap","光元刃","光元刃"]
[null,246015,"s_ly_0039_tap","光元刃","光元刃"]
[null,246021,"s_jz_0002_slide","月曜闪裂","月曜闪裂"]
[null,246022,"s_ly_0039_slide","月曜闪裂","月曜闪裂"]
[null,246023,"s_ly_0039_slide","月曜闪裂","月曜闪裂"]
[null,246024,"s_ly_0039_slide","月曜闪裂","月曜闪裂"]
[null,246025,"s_ly_0039_slide","月曜闪裂","月曜闪裂"]
[null,247011,"s_cff_0047_tap","焦热","焦热"]
[null,247012,"s_cff_0047_tap","焦热","焦热"]
[null,247013,"s_cff_0047_tap","焦热","焦热"]
[null,247014,"s_cff_0047_tap","焦热","焦热"]
[null,247015,"s_cff_0047_tap","焦热","焦热"]
[null,247021,""]
[null,247022,""]
[null,247023,""]
[null,247024,""]
[null,247025,""]
[null,248011,"s_yff_0048_tap","吹息","吹息"]
[null,248012,"s_yff_0048_tap","吹息","吹息"]
[null,248013,"s_yff_0048_tap","吹息","吹息"]
[null,{"$f":"B1611+1000","v":248014},"s_yff_0048_tap","吹息","吹息"]
[null,248015,"s_yff_0048_tap","吹息","吹息"]
[null,248021,""]
[null,248022,""]
[null,248023,""]
[null,248024,""]
[null,248025,""]
[null,249011,"s_cff_0049_tap","逐浪","逐浪"]
[null,249012,"s_cff_0049_tap","逐浪","逐浪"]
[null,249013,"s_cff_0049_tap","逐浪","逐浪"]
[null,249014,"s_cff_0049_tap","逐浪","逐浪"]
[null,249015,"s_cff_0049_tap","逐浪","逐浪"]
[null,249021,""]
[null,249022,""]
[null,249023,""]
[null,249024,""]
[null,249025,""]
[null,250011,"s_jff_0050_tap","岩落","岩落"]
[null,250012,"s_jff_0050_tap","岩落","岩落"]
[null,250013,"s_jff_0050_tap","岩落","岩落"]
[null,250014,"s_jff_0050_tap","岩落","岩落"]
[null,250015,"s_jff_0050_tap","岩落","岩落"]
[null,250021,""]
[null,250022,""]
[null,250023,""]
[null,250024,""]
[null,250025,""]
[null,251011,"s_ym_0051_tap","震元","震元"]
[null,251012,"s_ym_0051_tap","震元","震元"]
[null,251013,"s_ym_0051_tap","震元","震元"]
[null,{"$f":"B1641+1000","v":251014},"s_ym_0051_tap","震元","震元"]
[null,251015,"s_ym_0051_tap","震元","震元"]
[null,251021,""]
[null,251022,""]
[null,251023,""]
[null,251024,""]
[null,251025,""]
[null,252011,"s_ym_0052_tap","混沌","混沌"]
[null,252012,"s_ym_0052_tap","混沌","混沌"]
[null,252013,"s_ym_0052_tap","混沌","混沌"]
[null,252014,"s_ym_0052_tap","混沌","混沌"]
[null,252015,"s_ym_0052_tap","混沌","混沌"]
[null,252021,""]
[null,252022,""]
[null,252023,""]
[null,252024,""]
[null,252025,""]
[null,253011,"s_yxz_0057_tap","尹正霄"]
[null,253012,"s_yxz_0057_tap"]
[null,253013,"s_yxz_0057_tap"]
[null,253014,"s_yxz_0057_tap"]
[null,253015,"s_yxz_0057_tap"]
[null,253021,"s_yxz_0057_slide"]
[null,253022,"s_yxz_0057_slide"]
[null,253023,"s_yxz_0057_slide"]
[null,253024,"s_yxz_0057_slide"]
[null,253025,"s_yxz_0057_slide"]
[null,254011,"s_ne_0058_tap","凝儿"]
[null,254012,"s_ne_0058_tap"]
[null,254013,"s_ne_0058_tap"]
[null,254014,"s_ne_0058_tap"]
[null,254015,"s_ne_0058_tap"]
[null,254021,"s_ne_0058_slide"]
[null,254022,"s_ne_0058_slide"]
[null,254023,"s_ne_0058_slide"]
[null,254024,"s_ne_0058_slide"]
[null,254025,"s_ne_0058_slide"]
[null,255011,"s_ax_0067_tap","艾欣"]
[null,255012,"s_ax_0067_tap"]
[null,255013,"s_ax_0067_tap"]
[null,255014,"s_ax_0067_tap"]
[null,255015,"s_ax_0067_tap"]
[null,255021,"s_ax_0067_slide"]
[null,255022,"s_ax_0067_slide"]
[null,255023,"s_ax_0067_slide"]
[null,255024,"s_ax_0067_slide"]
[null,255025,"s_ax_0067_slide"]
[null,256011,"s_lhmn_0056_tap","晏息"]
[null,256012,"s_lhmn_0056_tap"]
[null,256013,"s_lhmn_0056_tap"]
[null,256014,"s_lhmn_0056_tap"]
[null,256015,"s_lhmn_0056_tap"]
[null,256021,"s_lhmn_0056_slide"]
[null,256022,"s_lhmn_0056_slide"]
[null,256023,"s_lhmn_0056_slide"]
[null,256024,"s_lhmn_0056_slide"]
[null,256025,"s_lhmn_0056_slide"]
[null,257011,"s_bm_0068_tap","白木"]
[null,257012,"s_bm_0068_tap"]
[null,257013,"s_bm_0068_tap"]
[null,257014,"s_bm_0068_tap"]
[null,257015,"s_bm_0068_tap"]
[null,257021,"s_bm_0068_slide"]
[null,257022,"s_bm_0068_slide"]
[null,257023,"s_bm_0068_slide"]
[null,257024,"s_bm_0068_slide"]
[null,257025,"s_bm_0068_slide"]
[null,258011,"s_xjr_0003_tap","柳月"]
[null,258012,"s_ly_0070_tap"]
[null,258013,"s_ly_0070_tap"]
[null,258014,"s_ly_0070_tap"]
[null,258015,"s_ly_0070_tap"]
[null,258021,"s_xjr_0003_slide"]
[null,258022,"s_ly_0070_slide"]
[null,258023,"s_ly_0070_slide"]
[null,258024,"s_ly_0070_slide"]
[null,258025,"s_ly_0070_slide"]
[null,259011,"s_ywe_0078_tap","炎琪儿"]
[null,259012,"s_yqe_0071_tap"]
[null,259013,"s_yqe_0071_tap"]
[null,259014,"s_yqe_0071_tap"]
[null,259015,"s_yqe_0071_tap"]
[null,259021,"s_ywe_0078_slide"]
[null,259022,"s_yqe_0071_slide"]
[null,259023,"s_yqe_0071_slide"]
[null,259024,"s_yqe_0071_slide"]
[null,259025,"s_yqe_0071_slide"]
[null,264011,"s_fzy_0061_tap","李靖"]
[null,264012,"s_fzy_0061_tap"]
[null,264013,"s_fzy_0061_tap"]
[null,264014,"s_fzy_0061_tap"]
[null,264015,"s_fzy_0061_tap"]
[null,264021,"s_fzy_0061_slide"]
[null,264022,"s_fzy_0061_slide"]
[null,264023,"s_fzy_0061_slide"]
[null,264024,"s_fzy_0061_slide"]
[null,264025,"s_fzy_0061_slide"]
[null,261011,"s_hyt_0032_tap","清然"]
[null,261012,"s_hyt_0032_tap"]
[null,261013,"s_hyt_0032_tap"]
[null,261014,"s_hyt_0032_tap"]
[null,261015,"s_hyt_0032_tap"]
[null,261021,"s_hyt_0032_slide"]
[null,261022,"s_hyt_0032_slide"]
[null,261023,"s_hyt_0032_slide"]
[null,261024,"s_hyt_0032_slide"]
[null,261025,"s_hyt_0032_slide"]
[null,262011,"s_zs_0080_tap","紫苏"]
[null,262012,"s_zs_0080_tap"]
[null,262013,"s_zs_0080_tap"]
[null,262014,"s_zs_0080_tap"]
[null,262015,"s_zs_0080_tap"]
[null,262021,"s_zs_0080_slide"]
[null,262022,"s_zs_0080_slide"]
[null,262023,"s_zs_0080_slide"]
[null,262024,"s_zs_0080_slide"]
[null,262025,"s_zs_0080_slide"]
[null,263011,"s_yqe_0071_tap","殷婉儿"]
[null,263012,"s_ywe_0078_tap"]
[null,263013,"s_ywe_0078_tap"]
[null,263014,"s_ywe_0078_tap"]
[null,263015,"s_ywe_0078_tap"]
[null,263021,"s_yqe_0071_slide"]
[null,263022,"s_ywe_0078_slide"]
[null,263023,"s_ywe_0078_slide"]
[null,263024,"s_ywe_0078_slide"]
[null,263025,"s_ywe_0078_slide"]
[null,260001,"r_Equip_Coat_0001","盔甲","1-6级绿色装备"]
[null,260002,"r_Equip_HeadAccessory_0001","头盔","1-6级绿色装备"]
[null,260003,"r_equip_Shoes_0001","战靴","1-6级绿色装备"]
[null,260004,"r_Equip_Belt_0001","腰带","1-6级绿色装备"]
[null,260005,"r_Equip_Ring_0001","戒指","1-6级绿色装备"]
[null,260006,"r_Equip_GuardianWeapon_0001","武卫武器","1-6级绿色装备"]
[null,260007,"r_Equip_PunisherWeapon_0001","天罚武器","1-6级绿色装备"]
[null,260008,"r_Equip_SecretWeapon_0001","秘法武器","1-6级绿色装备"]
[null,260009,"r_Equip_SchemeWeapon_0001","玄策武器","1-6级绿色装备"]
[null,260010,"r_Equip_HealingWeapon_0001","生花武器","1-6级绿色装备"]
[null,260011,"r_Equip_Coat_0002","盔甲","7-11级绿色装备\n7-11级蓝色装备"]
[null,260012,"r_Equip_HeadAccessory_0002","头盔","7-11级绿色装备\n7-11级蓝色装备"]
[null,260013,"r_equip_Shoes_0002","战靴","7-11级绿色装备\n7-11级蓝色装备"]
[null,260014,"r_Equip_Belt_0002","腰带","7-11级绿色装备\n7-11级蓝色装备"]
[null,260015,"r_Equip_Ring_0002","戒指","7-11级绿色装备\n7-11级蓝色装备"]
[null,260016,"r_Equip_GuardianWeapon_0002","武卫武器","7-11级绿色武器\n7-11级蓝色武器\n7-11级紫色武器\n9-12级橙色武器"]
[null,260017,"r_Equip_PunisherWeapon_0002","天罚武器","7-11级绿色武器\n7-11级蓝色武器\n7-11级紫色武器\n9-12级橙色武器"]
[null,260018,"r_Equip_SecretWeapon_0002","秘法武器","7-11级绿色武器\n7-11级蓝色武器\n7-11级紫色武器\n9-12级橙色武器"]
[null,260019,"r_Equip_SchemeWeapon_0002","玄策武器","7-11级绿色武器\n7-11级蓝色武器\n7-11级紫色武器\n9-12级橙色武器"]
[null,260020,"r_Equip_HealingWeapon_0002","生花武器","7-11级绿色武器\n7-11级蓝色武器\n7-11级紫色武器\n9-12级橙色武器"]
[null,260021,"r_Equip_Coat_0003","盔甲","12-16级绿色装备\n12-16级蓝色装备\n15-17级紫色装备\n16-17级橙色装备"]
[null,260022,"r_Equip_HeadAccessory_0003","头盔","12-16级绿色装备\n12-16级蓝色装备\n15-17级紫色装备\n16-17级橙色装备"]
[null,260023,"r_equip_Shoes_0003","战靴","12-16级绿色装备\n12-16级蓝色装备\n15-17级紫色装备\n16-17级橙色装备"]
[null,260024,"r_Equip_Belt_0003","腰带","12-16级绿色装备\n12-16级蓝色装备\n15-17级紫色装备\n16-17级橙色装备"]
[null,260025,"r_Equip_Ring_0003","戒指","12-16级绿色装备\n12-16级蓝色装备\n15-17级紫色装备\n16-17级橙色装备"]
[null,260026,"r_Equip_GuardianWeapon_0003","武卫武器","12-16级绿色武器\n12-16级蓝色武器\n12-16级紫色武器\n13-16级橙色武器"]
[null,260027,"r_Equip_PunisherWeapon_0003","天罚武器","12-16级绿色武器\n12-16级蓝色武器\n12-16级紫色武器\n13-16级橙色武器"]
[null,260028,"r_Equip_SecretWeapon_0003","秘法武器","12-16级绿色武器\n12-16级蓝色武器\n12-16级紫色武器\n13-16级橙色武器"]
[null,260029,"r_Equip_SchemeWeapon_0003","玄策武器","12-16级绿色武器\n12-16级蓝色武器\n12-16级紫色武器\n13-16级橙色武器"]
[null,260030,"r_Equip_HealingWeapon_0003","生花武器","12-16级绿色武器\n12-16级蓝色武器\n12-16级紫色武器\n13-16级橙色武器"]
[null,260031,"r_Equip_Coat_0004","盔甲","17-20级绿色装备\n17-20级蓝色装备\n18-20级紫色装备\n18-19级橙色装备"]
[null,260032,"r_Equip_HeadAccessory_0004","头盔","17-20级绿色装备\n17-20级蓝色装备\n18-20级紫色装备\n18-19级橙色装备"]
[null,260033,"r_equip_Shoes_0004","战靴","17-20级绿色装备\n17-20级蓝色装备\n18-20级紫色装备\n18-19级橙色装备"]
[null,260034,"r_Equip_Belt_0004","腰带","17-20级绿色装备\n17-20级蓝色装备\n18-20级紫色装备\n18-19级橙色装备"]
[null,260035,"r_Equip_Ring_0004","戒指","17-20级绿色装备\n17-20级蓝色装备\n18-20级紫色装备\n18-19级橙色装备"]
[null,260036,"r_Equip_GuardianWeapon_0004","武卫武器","17-20级绿色武器\n17-20级蓝色武器\n17-20级紫色武器\n17-18级橙色武器"]
[null,260037,"r_Equip_PunisherWeapon_0004","天罚武器","17-20级绿色武器\n17-20级蓝色武器\n17-20级紫色武器\n17-18级橙色武器"]
[null,260038,"r_Equip_SecretWeapon_0004","秘法武器","17-20级绿色武器\n17-20级蓝色武器\n17-20级紫色武器\n17-18级橙色武器"]
[null,260039,"r_Equip_SchemeWeapon_0004","玄策武器","17-20级绿色武器\n17-20级蓝色武器\n17-20级紫色武器\n17-18级橙色武器"]
[null,260040,"r_Equip_HealingWeapon_0004","生花武器","17-20级绿色武器\n17-20级蓝色武器\n17-20级紫色武器\n17-18级橙色武器"]
[null,260041,"r_Equip_Coat_0005","盔甲","20级橙色装备"]
[null,260042,"r_Equip_HeadAccessory_0005","头盔","20级橙色装备"]
[null,260043,"r_equip_Shoes_0005","战靴","20级橙色装备"]
[null,260044,"r_Equip_Belt_0005","腰带","20级橙色装备"]
[null,260045,"r_Equip_Ring_0005","戒指","20级橙色装备"]
[null,260046,"r_Equip_GuardianWeapon_0005","武卫武器","19-20级橙色武器"]
[null,260047,"r_Equip_PunisherWeapon_0005","天罚武器","19-20级橙色武器"]
[null,260048,"r_Equip_SecretWeapon_0005","秘法武器","19-20级橙色武器"]
[null,260049,"r_Equip_SchemeWeapon_0005","玄策武器","19-20级橙色武器"]
[null,260050,"r_Equip_HealingWeapon_0005","生花武器","19-20级橙色武器"]
[null,270001,"r_lianzao_skill_baojilv","暴击率"]
[null,270002,"r_lianzao_skill_baojishanghai","暴击伤害"]
[null,270003,"r_lianzao_skill_gongji","攻击"]
[null,270004,"r_lianzao_skill_hujia","护甲"]
[null,270005,"r_lianzao_skill_hujiamokang","护甲魔抗"]
[null,270006,"r_lianzao_skill_kangbaolv","抗暴击率"]
[null,270007,"r_lianzao_skill_mokang","魔抗"]
[null,270008,"r_lianzao_skill_shanghaijiacheng","伤害加成"]
[null,270009,"r_lianzao_skill_shanghaijiachengjianmian","伤害加成伤害减免"]
[null,270010,"r_lianzao_skill_shengming","生命"]
[null,270011,"r_lianzao_skill_shengmingongji","生命攻击"]
[null,270012,"r_lianzao_skill_shjm","伤害减免"]
[null,270013,"r_lianzao_skill_shouzhiliao","受治疗"]
[null,270014,"r_lianzao_skill_sudu","速度"]
[null,270015,"r_lianzao_skill_xiaoguodikang","效果抵抗"]
[null,270016,"r_lianzao_skill_xiaoguodikangmizhong","效果抵抗效果命中"]
[null,270017,"r_lianzao_skill_xiaoguomingzhong","效果命中"]
[null,270018,"r_lianzao_skill_zhiliao","治疗"]
[null,300000,"y_moren","默认头像框"]
[null,300001,"y_yueka_yuekua003","月卡专属头像框"]
[null,300002,"y_yueka_haohuayueka003","豪华月卡专属头像框"]
[null,300003,"y_huodong1","活动1头像框"]
[null,300004,"y_huodong2","活动2头像框"]
[null,300005,"y_huodong3","活动3头像框"]
[null,300006,"y_huodong4","活动4头像框"]
[null,300007,"y_dfs_guanjun001","巅峰赛冠军头像框"]
[null,80001,"r_hy_tiankui_0001","天魁-淡蓝"]
[null,80002,"r_hy_tiangang_0002","天罡-淡蓝"]
[null,80003,"r_hy_tianshang_0003","天伤-蓝绿"]
[null,80004,"r_hy_tianqiao_0004","天巧-深蓝"]
[null,80005,"r_hy_tiansu_0005","天枢-蓝色"]
[null,80006,"r_hy_diqi_0006","地契-红色"]
[null,80007,"r_hy_dikong_0007","地魁-红色"]
[null,80008,"r_hy_diyou_0008","地幽-红色"]
[null,80009,"r_hy_diyin_0009","地阴-红色"]
[null,80010,"r_hy_dizheng_0010","地争-红色"]
[null,80011,"r_shilian_zhadan","试炼炸弹"]
[null,81001,"z_zddh_ab","对话敖丙"]
[null,81002,"z_zddh_ljgz","对话龙吉公主"]
[null,81003,"z_zddh_lzz","对话雷震子"]
[null,81004,"z_zddh_nz","对话哪吒"]
[null,81005,"z_zddh_yj","对话杨戬"]
[null,81006,"z_zddh_xg","对话小怪"]
[null,82001,"d_dhxx_pl_jilong","东海寻仙龙吉拍脸图"]
[null,82002,"d_dhxx_pl_nezha","东海寻仙哪吒拍脸图"]
[null,82003,"d_dhxx_jilong","东海寻仙龙吉"]
[null,82004,"d_dhxx_nezha","东海寻仙哪吒"]
[null,100001,"r_hero_gongjili","攻击力"]
[null,100002,"r_hero_shangming","生命值"]
[null,100003,"r_hero_wufang","物理防御"]
[null,100004,"r_hero_kangxing","魔法抗性"]
[null,100005,"r_hero_sudu","速度"]
[null,90001,"r_fb_90001","风雷翅"]
[null,90002,"r_fb_bgj_0003","镇海石"]
[null,90003,"r_fb_djcj_0004","洛神赋"]
[null,90004,"r_fb_90004","断玉钩"]
[null,90005,"r_fb_zjl_0008","貔貅铃"]
[null,90006,"r_fb_90006","九齿钉耙"]
[null,90007,"r_fb_90007","倾世元禳"]
[null,90008,"r_fb_90008","彩羽衣"]
[null,90009,"r_fb_wmjl_0011","混世魔刀"]
[null,90010,"r_fb_90010","火尖枪"]
[null,90011,"r_fb_90011","八卦云光帕"]
[null,90012,"r_fb_mhh_0013","百花篮"]
[null,90013,"r_fb_90013","万龙甲"]
[null,90014,"r_fb_90014","金箍棒"]
[null,90015,"r_fb_90015","金刚宝剑"]
[null,90016,"r_fb_90016","锦襕袈裟"]
[null,90017,"r_fb_90017","孔雀翎"]
[null,90018,"r_fb_90018","灵柩灯"]
[null,90019,"r_fb_90019","清泉瓶"]
[null,90020,"r_fb_90020","伏虎钵"]
[null,90021,"r_fb_90021","降龙杖"]
[null,90022,"r_fb_90022","三钴杵"]
[null,90023,"r_fb_90023","六牙白象"]
[null,90024,"r_fb_90024","半月莲华"]
[null,90025,"r_fb_90025","吠陀经"]
[null,90026,"r_fb_90026","失心钵"]
[null,90027,"r_fb_90027","八卦炉"]
[null,90028,"r_fb_90028","风火轮"]
[null,90029,"r_fb_90029","道德真经"]
[null,90030,"r_fb_zjhl_0015","九黎壶"]
[null,90031,"r_fb_90031","雾露乾坤网"]
[null,90032,"r_fb_90032","青鸟使"]
[null,90033,"r_fb_90033","月兔"]
[null,90034,"r_fb_mnf_0010","定火符"]
[null,90035,"r_fb_90035","湘竹笛"]
[null,90036,"r_fb_90036","伐桂斧"]
[null,90037,"r_fb_90037","妈祖铜符"]
[null,90038,"r_fb_90038","定海珠"]
[null,90039,"r_fb_90039","两面三尖枪"]
[null,90040,"r_fb_90040","雷公鞭"]
[null,90041,"r_fb_90041","琉璃戒"]
[null,90042,"r_fb_90042","打神鞭"]
[null,90043,"r_fb_pll_0009","巨灵盾"]
[null,90044,"r_fb_90044","五行阵"]
[null,90045,"r_fb_90045","入梦铃"]
[null,90046,"r_fb_90046","纯阳剑"]
[null,90047,"r_fb_90047","诛仙四剑"]
[null,90048,"r_fb_90048","三宝如意"]
[null,90049,"r_fb_90049","阴狱锁"]
[null,90050,"r_fb_90050","孟婆汤"]
[null,90051,"r_fb_90051","托天叉"]
[null,90052,"r_fb_cqb_0006","阎王笔"]
[null,5000001,"c_ce_00034_t1","嫦娥魂印"]
[null,5000002,"c_sgb_00041_t1","申公豹魂印"]
[null,5000003,"c_pxps_00024_t1","普贤菩萨魂印"]
[null,5000004,"c_wsps_00016_t1","达摩魂印"]
[null,5000005,"c_hhe_00011_t1","红孩儿魂印"]
[null,5000006,"c_hsmw_00010_t1","混世魔王魂印"]
[null,5000007,"c_wg_00037_t1","吴刚魂印"]
[null,5000008,"c_jcdp_00027_t1","金翅大鹏魂印"]
[null,5000009,"c_dj_0008_t1","妲己魂印"]
[null,5000010,"c_jbj_0007_t1","猪八戒魂印"]
[null,5000011,"c_fx_00028_t1","伏羲魂印"]
[null,5000012,"c_jw_0003_t1","精卫魂印"]
[null,5000013,"c_bhxz_00013_t1","百花仙子魂印"]
[null,5000014,"c_ts_00017_t1","唐僧魂印"]
[null,5000015,"c_jtxn_00045_t1","九天玄女魂印"]
[null,5000016,"c_swk_00015_t1","孙悟空魂印"]
[null,5000017,"c_xllh_00022_t1","降龙罗汉魂印"]
[null,5000018,"c_kqmw_00018_t1","孔雀明王魂印"]
[null,5000019,"c_rd_00019_t1","燃灯魂印"]
[null,5000020,"c_ygps_00025_t1","月光菩萨魂印"]
[null,5000021,"c_ljgz_00032_t1","龙吉公主魂印"]
[null,5000022,"c_jmm_0006_t1","九命猫魂印"]
[null,5000023,"c_cy_00031_t1","蚩尤魂印"]
[null,5000024,"c_mz_00038_t1","妈祖魂印"]
[null,5000025,"c_eh_00035_t1","娥皇魂印"]
[null,5000026,"r_hy_0025","冥毒邪宴魂印"]
[null,5000027,"c_lslz_00046_t1","太阴星君魂印"]
[null,5000028,"c_jls_00044_t1","巨灵神魂印"]
[null,5000029,"c_ttjz_00048_t1","通天教主魂印"]
[null,5000030,"c_lc_00050_t1","罗刹魂印"]
[null,5000031,"c_yc_00052_t1","夜叉魂印"]
[null,5000032,"c_dst_00023_t1","帝释天魂印"]
[null,5000033,"r_hy_zxjz_0024","瘟癀疫病魂印"]
[null,5000034,"r_hy_ycmh_0020","蚀骨火毒魂印"]
[null,5000035,"r_hy_mzbh_0007","妈祖庇佑魂印"]
[null,5000036,"c_ghn_0009_t1","姑获鸟魂印"]
[null,5000037,"c_ab_00014_t1","敖丙魂印"]
[null,5000038,"r_hy_yjjl_0021","义结金兰魂印"]
[null,5000039,"r_hy_qncx_0015","青鸟传信魂印"]
[null,5000040,"r_hy_hslc_0002","火烧连城魂印"]
[null,5000041,"r_hy_pxnz_0011","破邪怒斩魂印"]
[null,5000042,"r_hy_ttks_0004","狂噬戮兽魂印"]
[null,5000043,"c_nz_00029_t1","哪吒魂印"]
[null,5000044,"r_hy_sxbn_0017","失心暴怒魂印"]
[null,5000045,"r_hy_qshs_0013","起死回生魂印"]
[null,5000046,"r_hy_pj_0010","破军魂印"]
[null,5000047,"r_hy_bxsh_0009","辟邪守护魂印"]
[null,5000048,"r_hy_pzcx_0012","破阵穿心魂印"]
[null,5000049,"r_hy_tttj_0018","饕餮吞鲸魂印"]
[null,5000050,"r_hy_zyjq_0023","斩妖净气魂印"]
[null,5000051,"r_hy_xnzy_0019","羲农之佑魂印"]
[null,5000052,"r_hy_zycm_0001","除妖斩魔魂印"]
[null,5000053,"r_hy_lzzq_0005","历战之躯魂印"]
[null,5000054,"r_hy_ssjs_0016","舍身济世魂印"]
[null,5000055,"r_hy_lqht_0006","灵气护体魂印"]
[null,5000056,"r_hy_mhyj_0008","灭魂一击魂印"]
[null,5000057,"r_hy_jxfh_0003","见血封喉魂印"]
[null,5000058,"r_hy_yyth_0022","阴阳调和魂印"]
[null,5000059,"r_hy_qyzw_0014","气运在握魂印"]
[null,6000001,"i_s_2006830_xne","雷棍"]
[null,6000002,"i_s_2006810_xne","风卷雷涌"]
[null,6000003,"i_s_3810_ym","石落"]
[null,6000004,"i_s_3820_ym","精卫填海"]
[null,6000005,"i_s_3830_ym","流觞"]
[null,6000006,"i_s_1550_yzy","洛水横断"]
[null,6000007,"i_s_7520_nxy","水怒"]
[null,6000008,"i_s_1410_hylr","暗流狂涌"]
[null,6000009,"i_s_2120_ny","喵愈"]
[null,6000010,"i_s_2150_ny","猫有九命"]
[null,6000011,"i_s_1110_dj","耙击"]
[null,6000012,"i_s_1120_dj","天蓬余威"]
[null,6000013,"i_s_2005550_sje","狐媚"]
[null,6000014,"i_s_2005510_sje","狐媚惑心"]
[null,6000015,"i_s_2620_yysz","鬼车"]
[null,6000016,"i_s_2640_yysz","夜行游女"]
[null,6000017,"i_s_1130_dj","乱刀"]
[null,6000018,"i_s_1330_sx","混世邪斩"]
[null,6000019,"i_s_1310_sx","枪花"]
[null,6000020,"i_s_1320_sx","三昧真火"]
[null,6000021,"i_s_5520_lz","邪光"]
[null,6000022,"i_s_5510_lz","八卦邪帕"]
[null,6000023,"i_s_tybd_05","花吻"]
[null,6000024,"i_s_1810_yx","灵花绽放"]
[null,6000025,"i_s_2020_lzls","雷波"]
[null,6000026,"i_s_2010_lzls","龙子唤雷"]
[null,6000027,"i_s_1140_dj","千钧"]
[null,6000028,"i_s_1150_dj","奋起千钧"]
[null,6000029,"i_s_2030_lzls","断恼"]
[null,6000030,"i_s_2040_lzls","除尽群魔"]
[null,6000031,"i_s_1210_ls","祈祷"]
[null,6000032,"i_s_1220_ls","九转灵禅"]
[null,6000033,"i_s_48500_sf","彩羽"]
[null,6000034,"i_s_4730_cn","明王真经"]
[null,6000035,"i_s_3730_yl","佛威"]
[null,6000036,"i_s_3710_yl","古佛托梦"]
[null,6000037,"i_s_1840_yx","甘露"]
[null,6000038,"i_s_1830_yx","观音普度"]
[null,6000039,"i_s_3410_yhzs","虎爪"]
[null,6000040,"i_s_3440_yhzs","虎啸山林"]
[null,6000041,"i_s_2001740_yls","降龙"]
[null,6000042,"i_s_7340_nxt","翻天佛印"]
[null,6000043,"i_s_3840_ym","护佛"]
[null,6000044,"i_s_3850_ym","诸邪退散"]
[null,6000045,"i_s_2550_yy","践踏"]
[null,6000046,"i_s_6510_nxf","象蹄冲撞"]
[null,6000047,"i_s_3520_gmls","月光"]
[null,6000048,"i_s_3550_gmls","月色皎然"]
[null,6000049,"i_s_1650_dz","梵波"]
[null,6000050,"i_s_1630_dz","创世余波"]
[null,6000051,"i_s_ysz_12","金羽"]
[null,6000052,"i_s_7220_ly","大鹏展翅"]
[null,6000053,"i_s_ysz_14","日炎"]
[null,6000054,"i_s_7210_ly","烈日灼烧"]
[null,6000055,"i_s_ysz_21","枪刺"]
[null,6000056,"i_s_2005520_sje","天降火莲"]
[null,6000057,"i_s_5650_sks","献体"]
[null,6000058,"i_s_1340_sx","千手千眼"]
[null,6000059,"i_s_1920_dz","怒兽"]
[null,6000060,"i_s_1910_dz","蛮荒乱击"]
[null,6000061,"i_s_ysz_1","连斩"]
[null,6000062,"i_s_5610_sks","红鸾乱舞"]
[null,6000063,"i_s_5220_xx","火符"]
[null,6000064,"i_s_4820_sf","火蛇狂卷"]
[null,6000065,"i_s_2005620_gs","兔蹬"]
[null,6000066,"i_s_2005610_gs","玉兔纷乱"]
[null,6000067,"i_s_2510_yy","炎灼"]
[null,6000068,"i_s_2530_yy","火烧连城"]
[null,6000069,"i_s_4120_nl","穿神"]
[null,6000070,"i_s_5240_xx","驱魔慑鬼"]
[null,6000071,"i_s_2830_yx","飞斧"]
[null,6000072,"i_s_2840_yx","吴刚伐桂"]
[null,6000073,"i_s_2000820_hy","护海"]
[null,6000074,"i_s_2000850_hy","断罪除邪"]
[null,6000075,"i_s_4130_nl","定海"]
[null,6000076,"i_s_4840_sf","纵火灵符"]
[null,6000077,"i_s_tybd_06","天眼"]
[null,6000078,"i_s_tybd_08","风卷残云"]
[null,6000079,"i_s_5120_yz","鞭击"]
[null,6000080,"i_s_3930_xne","雷光霹雳"]
[null,6000081,"i_s_2002730_zhs","瞬剑"]
[null,6000082,"i_s_4540_yh","东华剑法"]
[null,6000083,"i_s_2001830_dz","天道"]
[null,6000084,"i_s_2001810_dz","诸邪退避"]
[null,6000085,"i_s_4301_jzls","盾猛"]
[null,6000086,"i_s_4304_jzls","巨灵神威"]
[null,6000087,"i_s_6220_xy","兵戎"]
[null,6000088,"i_s_6230_xy","五行连斩"]
[null,6000089,"i_s_3050_gy","试道"]
[null,6000090,"i_s_2520_yy","骊山道法"]
[null,6000091,"i_s_2000940_lyy","天遁"]
[null,6000092,"i_s_2001010_gb","全真剑法"]
[null,6000093,"i_s_2000350_xy","飞剑"]
[null,6000094,"i_s_2000320_xy","诛仙剑阵"]
[null,6000095,"i_s_3140_tzls","论道"]
[null,6000096,"i_s_3130_tzls","三生万物"]
[null,6000097,"i_s_3210_hals","锁魂"]
[null,6000098,"i_s_3230_hals","生死有命"]
[null,6000099,"i_s_2720_swls","试汤"]
[null,6000100,"i_s_2710_swls","了却凡尘"]
[null,6000101,"i_s_1710_lp","夜行"]
[null,6000102,"i_s_1730_lp","夜叉魔火"]
[null,6000103,"i_s_2000510_hw","判笔"]
[null,6000104,"i_s_2000520_hw","判官断命"]
[null,6000105,"i_s_2740_swls","倩魂"]
[null,6000106,"i_s_2350_m","灵幽缠"]
[null,6000107,"i_s_3420_yhzs","九头"]
[null,6000108,"i_s_9050_wy","九婴火"]
[null,6000109,"i_s_4050_yz","灵击"]
[null,6000110,"i_s_4020_yz","怨灵怒"]
[null,6000111,"i_s_3330_hdls","魂乱"]
[null,6000112,"i_s_3320_hdls","百鬼行"]
[null,6000113,"i_s_2001520_jzwb","大悲"]
[null,6000114,"i_s_2001530_jzwb","秽土居"]
[null,6000115,"i_s_2000610_bw","驱蛇"]
[null,6000116,"i_s_1820_yx","羽箭流"]
[null,6000117,"i_s_2000950_lyy","御龙"]
[null,6000118,"i_s_2001020_gb","净恶断"]
[null,6000119,"i_s_3020_gy","非天"]
[null,6000120,"i_s_9810_hyjl","修罗斩"]
[null,6000121,"i_s_2002030_wy","重击"]
[null,6000122,"i_s_5820_sy","破邪斩"]
[null,6000123,"i_s_3620_gs","连弩"]
[null,6000124,"i_s_3720_yl","连环箭"]
[null,6000125,"i_s_3040_gy","化蝶"]
[null,6000126,"i_s_2110_ny","庄周梦"]
[null,6000127,"i_s_4303_jzls","盾击"]
[null,6000128,"i_s_tybd_03","遁龙桩"]
[null,6000129,"i_s_5620_sks","神火"]
[null,6000130,"i_s_3010_gy","乱离火"]
[null,6000131,"i_s_7540_nxy","殇水"]
[null,6000132,"i_s_1000310_bxjl","水波击"]
[null,6000133,"i_s_6330_lq","流击"]
[null,6000134,"i_s_tybd_13","渊流破"]
[null,6000135,"i_s_7510_nxy","仙扇"]
[null,6000136,"i_s_7530_nxy","扇环舞"]
[null,6000137,"i_s_5230_xx","野火"]
[null,6000138,"i_s_2005540_sje","掷火"]
[null,6000139,"i_s_5830_sy","抓挠"]
[null,6000140,"i_s_5640_sks","啃咬"]
[null,6000141,"i_s_1430_hylr","水灵"]
[null,6000142,"i_s_1520_yzy","冰落"]
[null,6000143,"i_s_tybd_07","藤击"]
[null,6000144,"i_s_3030_gy","青柳"]
[null,6000145,"i_s_2005630_gs","灵符"]
[null,6000146,"i_s_2005650_gs","太极"]
[null,6000147,"i_s_2002130_yl","结草"]
[null,6000148,"i_s_2000450_gzn","咒缚"]
[null,6000149,"i_s_5920_sy","魂链"]
[null,6000150,"i_s_5940_sy","缚灵"]
[null,6000151,"i_s_3120_tzls","仙音"]
[null,6000152,"i_s_3110_tzls","传谕"]
[null,6000153,"i_s_5230_xx","野火"]
[null,6000154,"i_s_2005540_sje","掷火"]
[null,6000155,"i_s_1430_hylr","水灵"]
[null,6000156,"i_s_1520_yzy","冰落"]
[null,6000157,"i_s_2005630_gs","灵符"]
[null,6000158,"i_s_2005650_gs","太极"]
[null,6000159,"i_s_5920_sy","魂链"]
[null,6000160,"i_s_5940_sy","缚灵"]
[null,6000161,"i_s_5230_xx","野火"]
[null,6000162,"i_s_2005540_sje","掷火"]
[null,6000163,"i_s_1430_hylr","水灵"]
[null,6000164,"i_s_1520_yzy","冰落"]
[null,6000165,"i_s_2005630_gs","灵符"]
[null,6000166,"i_s_2005650_gs","太极"]
[null,6000167,"i_s_5920_sy","魂链"]
[null,6000168,"i_s_5940_sy","缚灵"]
[null,8000001,"q_qiankun_duihuan_01","魂印活动兑换道具"]

{"sheet":"Sheet4","index":1,"n_rows":52,"n_cols":1,"rows_kept":52}
["r_fb_90001"]
["r_fb_90002"]
["r_fb_90003"]
["r_fb_90004"]
["r_fb_90005"]
["r_fb_90006"]
["r_fb_90007"]
["r_fb_90008"]
["r_fb_90009"]
["r_fb_90010"]
["r_fb_90011"]
["r_fb_90012"]
["r_fb_90013"]
["r_fb_90014"]
["r_fb_90015"]
["r_fb_90016"]
["r_fb_90017"]
["r_fb_90018"]
["r_fb_90019"]
["r_fb_90020"]
["r_fb_90021"]
["r_fb_90022"]
["r_fb_90023"]
["r_fb_90024"]
["r_fb_90025"]
["r_fb_90026"]
["r_fb_90027"]
["r_fb_90028"]
["r_fb_90029"]
["r_fb_90030"]
["r_fb_90031"]
["r_fb_90032"]
["r_fb_90033"]
["r_fb_90034"]
["r_fb_90035"]
["r_fb_90036"]
["r_fb_90037"]
["r_fb_90038"]
["r_fb_90039"]
["r_fb_90040"]
["r_fb_90041"]
["r_fb_90042"]
["r_fb_90043"]
["r_fb_90044"]
["r_fb_90045"]
["r_fb_90046"]
["r_fb_90047"]
["r_fb_90048"]
["r_fb_90049"]
["r_fb_90050"]
["r_fb_90051"]
["r_fb_90052"]

{"sheet":"辅助表","index":2,"n_rows":521,"n_cols":35,"rows_kept":521}
[null,"id"]
[null,10001,{"$f":"RIGHT(B2,2)","v":"01"},"c_syf_0016",{"$nulls":3},"c_首字母_id",{"$nulls":7},201011,{"$f":"MID(P2,2,2)","v":"01"},{"$f":"MID(P2,5,1)","v":"1"},{"$f":"VLOOKUP(Q2,$C$2:$D$53,2,0)","v":"c_syf_0016"},"_tap",{"$f":"S2&T2","v":"c_syf_0016_tap"},null,null,"凌甲",{"$f":"IF(X2=\"\",\"\",U2)","v":"c_syf_0016_tap"},{"$nulls":4},"r","Resource","AP",1,null,{"$f":"[2]!SUMSTRING(AD2:AG2,\"_\")","v":{"$error":"#NAME?"}}]
[null,10002,{"$f":"RIGHT(B3,2)","v":"02"},"c_ch_0015",{"$nulls":11},201012,{"$f":"MID(P3,2,2)","v":"01"},{"$f":"MID(P3,5,1)","v":"1"},{"$f":"VLOOKUP(Q3,$C$2:$D$53,2,0)","v":"c_syf_0016"},"_tap",{"$f":"S3&T3","v":"c_syf_0016_tap"},null,null,"凌甲",{"$f":"IF(X3=\"\",\"\",U3)","v":"c_syf_0016_tap"},{"$nulls":4},"r","Resource","AP",2,null,{"$f":"[2]!SUMSTRING(AD3:AG3,\"_\")","v":{"$error":"#NAME?"}}]
[null,10003,"03","c_xhht_0017",{"$nulls":11},201013,"01","1","c_syf_0016","_tap","c_syf_0016_tap",null,null,"凌甲","c_syf_0016_tap",{"$nulls":4},"r","LvUpItem","CharaGU",1,null,{"$f":"[2]!SUMSTRING(AD4:AG4,\"_\")","v":{"$error":"#NAME?"}}]
[null,10004,"04","c_yr_0007",{"$nulls":5},1,"tap",{"$nulls":4},201014,"01","1","c_syf_0016","_tap","c_syf_0016_tap",null,null,"凌甲","c_syf_0016_tap",{"$nulls":4},"r","act","emmc","scoreup",null,{"$f":"[2]!SUMSTRING(AD5:AG5,\"_\")","v":{"$error":"#NAME?"}}]
[null,10005,"05","c_dmk_0043",{"$nulls":5},2,"slid",{"$nulls":4},201015,"01","1","c_syf_0016","_tap","c_syf_0016_tap",null,null,"凌甲","c_syf_0016_tap",{"$nulls":4},"r","LvUpItem","CharaGU",3,null,{"$f":"[2]!SUMSTRING(AD6:AG6,\"_\")","v":{"$error":"#NAME?"}}]
[null,10006,"06","c_qlq_0006",{"$nulls":11},201021,"01","2","c_syf_0016","_slide","c_syf_0016_slide",null,null,"震岳","c_syf_0016_slide",{"$nulls":4},"r","LvUpItem","CharaGU",4,null,{"$f":"[2]!SUMSTRING(AD7:AG7,\"_\")","v":{"$error":"#NAME?"}}]
[null,10007,"07","c_jz_0002",{"$nulls":11},201022,"01","2","c_syf_0016","_slide","c_syf_0016_slide",null,null,"震岳","c_syf_0016_slide",{"$nulls":4},"r","Box","CharaGUBox",3,null,{"$f":"[2]!SUMSTRING(AD8:AG8,\"_\")","v":{"$error":"#NAME?"}}]
[null,10008,"08","c_bmf_0004",{"$nulls":11},201023,"01","2","c_syf_0016","_slide","c_syf_0016_slide",null,null,"震岳","c_syf_0016_slide",{"$nulls":4},"r","Box","CharaGUBox",4,null,{"$f":"[2]!SUMSTRING(AD9:AG9,\"_\")","v":{"$error":"#NAME?"}}]
[null,10009,"09","c_qf_0046",{"$nulls":11},201024,"01","2","c_syf_0016","_slide","c_syf_0016_slide",null,null,"震岳","c_syf_0016_slide",{"$nulls":4},"r","Box","CharaGUBox",5,null,{"$f":"[2]!SUMSTRING(AD10:AG10,\"_\")","v":{"$error":"#NAME?"}}]
[null,10010,"10","c_yqj_0042",{"$nulls":11},201025,"01","2","c_syf_0016","_slide","c_syf_0016_slide",null,null,"震岳","c_syf_0016_slide",{"$nulls":4},"r","Box","CharaGUBox",6,null,{"$f":"[2]!SUMSTRING(AD11:AG11,\"_\")","v":{"$error":"#NAME?"}}]
[null,10011,"11","c_yy_0041",{"$nulls":11},202011,"02","1","c_ch_0015",{"$f":"T2","v":"_tap"},"c_ch_0015_tap",null,null,"啸牙","c_ch_0015_tap",{"$nulls":4},"r","Box","CharaGUBox",7,null,{"$f":"[2]!SUMSTRING(AD12:AG12,\"_\")","v":{"$error":"#NAME?"}}]
[null,10012,"12","c_mrzq_0010",{"$nulls":11},202012,"02","1","c_ch_0015",{"$f":"T3","v":"_tap"},"c_ch_0015_tap",null,null,"啸牙","c_ch_0015_tap",{"$nulls":4},"r","Box","CharaGUBox",8,null,{"$f":"[2]!SUMSTRING(AD13:AG13,\"_\")","v":{"$error":"#NAME?"}}]
[null,10013,"13","c_yl_0014",{"$nulls":11},202013,"02","1","c_ch_0015","_tap","c_ch_0015_tap",null,null,"啸牙","c_ch_0015_tap",{"$nulls":4},"r","Box","CharaGUBox",9,null,{"$f":"[2]!SUMSTRING(AD14:AG14,\"_\")","v":{"$error":"#NAME?"}}]
[null,10014,"14","c_gt_0001",{"$nulls":11},202014,"02","1","c_ch_0015","_tap","c_ch_0015_tap",null,null,"啸牙","c_ch_0015_tap",{"$nulls":4},"r","act",2,null,null,{"$f":"[2]!SUMSTRING(AD15:AG15,\"_\")","v":{"$error":"#NAME?"}}]
[null,10015,"15","c_xy_0012",{"$nulls":11},202015,"02","1","c_ch_0015","_tap","c_ch_0015_tap",null,null,"啸牙","c_ch_0015_tap",{"$nulls":4},"r","Resource","Coin",2,null,{"$f":"[2]!SUMSTRING(AD16:AG16,\"_\")","v":{"$error":"#NAME?"}}]
[null,10016,"16","c_cyh_0008",{"$nulls":11},202021,"02","2","c_ch_0015","_slide","c_ch_0015_slide",null,null,"白虎风涛","c_ch_0015_slide",{"$nulls":4},"r","Resource","Coin",3,null,{"$f":"[2]!SUMSTRING(AD17:AG17,\"_\")","v":{"$error":"#NAME?"}}]
[null,10017,"17","c_sxdw_0053",{"$nulls":11},202022,"02","2","c_ch_0015","_slide","c_ch_0015_slide",null,null,"白虎风涛","c_ch_0015_slide",{"$nulls":4},"r","Resource","Exp",1,null,{"$f":"[2]!SUMSTRING(AD18:AG18,\"_\")","v":{"$error":"#NAME?"}}]
[null,10018,"18","c_zh_0044",{"$nulls":11},202023,"02","2","c_ch_0015","_slide","c_ch_0015_slide",null,null,"白虎风涛","c_ch_0015_slide",{"$nulls":4},"r","Resource","Exp",2,null,{"$f":"[2]!SUMSTRING(AD19:AG19,\"_\")","v":{"$error":"#NAME?"}}]
[null,10019,"19","c_kq_0018",{"$nulls":11},202024,"02","2","c_ch_0015","_slide","c_ch_0015_slide",null,null,"白虎风涛","c_ch_0015_slide",{"$nulls":4},"r","RareItem","Specail",1,null,{"$f":"[2]!SUMSTRING(AD20:AG20,\"_\")","v":{"$error":"#NAME?"}}]
[null,10020,"20","c_ywy_0040",{"$nulls":11},202025,"02","2","c_ch_0015","_slide","c_ch_0015_slide",null,null,"白虎风涛","c_ch_0015_slide",{"$nulls":4},"r","RareItem","Specail",2,null,{"$f":"[2]!SUMSTRING(AD21:AG21,\"_\")","v":{"$error":"#NAME?"}}]
[null,10021,"21","c_mlmn_0054",{"$nulls":11},203011,"03","1","c_xhht_0017","_tap","c_xhht_0017_tap",null,null,"断鸿","c_xhht_0017_tap",{"$nulls":4},"r","Material","Mineral",1,null,{"$f":"[2]!SUMSTRING(AD22:AG22,\"_\")","v":{"$error":"#NAME?"}}]
[null,10022,"22","c_ywg_0045",{"$nulls":11},203012,"03","1","c_xhht_0017","_tap","c_xhht_0017_tap",null,null,"断鸿","c_xhht_0017_tap",{"$nulls":4},"r","Material","Mineral",2,null,{"$f":"[2]!SUMSTRING(AD23:AG23,\"_\")","v":{"$error":"#NAME?"}}]
[null,10023,"23","c_y_0013",{"$nulls":11},203013,"03","1","c_xhht_0017","_tap","c_xhht_0017_tap",null,null,"断鸿","c_xhht_0017_tap",{"$nulls":4},"r","Material","Mineral",3,null,{"$f":"[2]!SUMSTRING(AD24:AG24,\"_\")","v":{"$error":"#NAME?"}}]
[null,10024,"24","c_xjr_0003",{"$nulls":11},203014,"03","1","c_xhht_0017","_tap","c_xhht_0017_tap",null,null,"断鸿","c_xhht_0017_tap",{"$nulls":4},"r","Material","Mineral",4,null,{"$f":"[2]!SUMSTRING(AD25:AG25,\"_\")","v":{"$error":"#NAME?"}}]
[null,10025,"25","c_tx_0011",{"$nulls":11},203015,"03","1","c_xhht_0017","_tap","c_xhht_0017_tap",null,null,"断鸿","c_xhht_0017_tap",{"$nulls":4},"r","Material","Mineral",5,null,{"$f":"[2]!SUMSTRING(AD26:AG26,\"_\")","v":{"$error":"#NAME?"}}]
[null,10026,"26","c_sq_0019",{"$nulls":11},203021,"03","2","c_xhht_0017","_slide","c_xhht_0017_slide",null,null,"裂山贯云","c_xhht_0017_slide",{"$nulls":4},"r","Material","Mineral",6,null,{"$f":"[2]!SUMSTRING(AD27:AG27,\"_\")","v":{"$error":"#NAME?"}}]
[null,10027,"27","c_nye_0020",{"$nulls":11},203022,"03","2","c_xhht_0017","_slide","c_xhht_0017_slide",null,null,"裂山贯云","c_xhht_0017_slide",{"$nulls":4},"r","Material","MakedMineral",1,null,{"$f":"[2]!SUMSTRING(AD28:AG28,\"_\")","v":{"$error":"#NAME?"}}]
[null,10028,"28","c_zc_0021",{"$nulls":11},203023,"03","2","c_xhht_0017","_slide","c_xhht_0017_slide",null,null,"裂山贯云","c_xhht_0017_slide",{"$nulls":4},"r","Material","MakedMineral",2,null,{"$f":"[2]!SUMSTRING(AD29:AG29,\"_\")","v":{"$error":"#NAME?"}}]
[null,10029,"29","c_lhmn_0056",{"$nulls":11},203024,"03","2","c_xhht_0017","_slide","c_xhht_0017_slide",null,null,"裂山贯云","c_xhht_0017_slide",{"$nulls":4},"r","Material","MakedMineral",3,null,{"$f":"[2]!SUMSTRING(AD30:AG30,\"_\")","v":{"$error":"#NAME?"}}]
[null,10030,"30","c_yy_0023",{"$nulls":11},203025,"03","2","c_xhht_0017","_slide","c_xhht_0017_slide",null,null,"裂山贯云","c_xhht_0017_slide",{"$nulls":4},"r","Box","MineralBox",1,null,{"$f":"[2]!SUMSTRING(AD31:AG31,\"_\")","v":{"$error":"#NAME?"}}]
[null,10031,"31","c_jpw_0024",{"$nulls":11},204011,"04","1","c_yr_0007","_tap","c_yr_0007_tap",null,null,"轻流","c_yr_0007_tap",{"$nulls":4},"r","Box","MineralBox",2,null,{"$f":"[2]!SUMSTRING(AD32:AG32,\"_\")","v":{"$error":"#NAME?"}}]
[null,10032,"32","c_ly_0025",{"$nulls":11},204012,"04","1","c_yr_0007","_tap","c_yr_0007_tap",null,null,"轻流","c_yr_0007_tap",{"$nulls":4},"r","Box","MineralBox",3,null,{"$f":"[2]!SUMSTRING(AD33:AG33,\"_\")","v":{"$error":"#NAME?"}}]
[null,10033,"33","c_xy_0026",{"$nulls":11},204013,"04","1","c_yr_0007","_tap","c_yr_0007_tap",null,null,"轻流","c_yr_0007_tap",{"$nulls":4},"r","Box","MineralBox",4,null,{"$f":"[2]!SUMSTRING(AD34:AG34,\"_\")","v":{"$error":"#NAME?"}}]
[null,10034,"34","c_fm_0027",{"$nulls":11},204014,"04","1","c_yr_0007","_tap","c_yr_0007_tap",null,null,"轻流","c_yr_0007_tap",{"$nulls":4},"r","Box","MineralBox",5,null,{"$f":"[2]!SUMSTRING(AD35:AG35,\"_\")","v":{"$error":"#NAME?"}}]
[null,10035,"35","c_skr_0028",{"$nulls":11},204015,"04","1","c_yr_0007","_tap","c_yr_0007_tap",null,null,"轻流","c_yr_0007_tap",{"$nulls":4},"r","Box","MineralBox",6,null,{"$f":"[2]!SUMSTRING(AD36:AG36,\"_\")","v":{"$error":"#NAME?"}}]
[null,10036,"36","c_jy_0029",{"$nulls":11},204021,"04","2","c_yr_0007","_slide","c_yr_0007_slide",null,null,"天咏诀","c_yr_0007_slide",{"$nulls":4},"r","Box","MineralBox",7,null,{"$f":"[2]!SUMSTRING(AD37:AG37,\"_\")","v":{"$error":"#NAME?"}}]
[null,10037,"37","c_xl_0030",{"$nulls":11},204022,"04","2","c_yr_0007","_slide","c_yr_0007_slide",null,null,"天咏诀","c_yr_0007_slide",{"$nulls":4},"r","Box","MineralBox",8,null,{"$f":"[2]!SUMSTRING(AD38:AG38,\"_\")","v":{"$error":"#NAME?"}}]
[null,10038,"38","c_cs_0031",{"$nulls":11},204023,"04","2","c_yr_0007","_slide","c_yr_0007_slide",null,null,"天咏诀","c_yr_0007_slide",{"$nulls":4},"r","Box","MineralBox",9,null,{"$f":"[2]!SUMSTRING(AD39:AG39,\"_\")","v":{"$error":"#NAME?"}}]
[null,10039,"39","c_hyt_0032",{"$nulls":11},204024,"04","2","c_yr_0007","_slide","c_yr_0007_slide",null,null,"天咏诀","c_yr_0007_slide",{"$nulls":4},"r","Box","MineralBox",10,null,{"$f":"[2]!SUMSTRING(AD40:AG40,\"_\")","v":{"$error":"#NAME?"}}]
[null,10040,"40","c_rj_0033",{"$nulls":11},204025,"04","2","c_yr_0007","_slide","c_yr_0007_slide",null,null,"天咏诀","c_yr_0007_slide",{"$nulls":4},"r","Box","MineralBox",11,null,{"$f":"[2]!SUMSTRING(AD41:AG41,\"_\")","v":{"$error":"#NAME?"}}]
[null,10041,"41","c_mc_0034",{"$nulls":11},205011,"05","1","c_dmk_0043","_tap","c_dmk_0043_tap",null,null,"长槐琼灯","c_dmk_0043_tap",{"$nulls":4},"r","Box","MineralBox",12,null,{"$f":"[2]!SUMSTRING(AD42:AG42,\"_\")","v":{"$error":"#NAME?"}}]
[null,10042,"42","c_yl_0035",{"$nulls":11},205012,"05","1","c_dmk_0043","_tap","c_dmk_0043_tap",null,null,"长槐琼灯","c_dmk_0043_tap",{"$nulls":4},"r","RareItem","Specail",3,null,{"$f":"[2]!SUMSTRING(AD43:AG43,\"_\")","v":{"$error":"#NAME?"}}]
[null,10043,"43","c_wl_0036",{"$nulls":11},205013,"05","1","c_dmk_0043","_tap","c_dmk_0043_tap",null,null,"长槐琼灯","c_dmk_0043_tap",{"$nulls":4},"r","RareItem","Specail",4,null,{"$f":"[2]!SUMSTRING(AD44:AG44,\"_\")","v":{"$error":"#NAME?"}}]
[null,10044,"44","c_fjzd_0055",{"$nulls":11},205014,"05","1","c_dmk_0043","_tap","c_dmk_0043_tap",null,null,"长槐琼灯","c_dmk_0043_tap",{"$nulls":4},"r","RareItem","Specail",5,null,{"$f":"[2]!SUMSTRING(AD45:AG45,\"_\")","v":{"$error":"#NAME?"}}]
[null,10045,"45","c_sk_0038",{"$nulls":11},205015,"05","1","c_dmk_0043","_tap","c_dmk_0043_tap",null,null,"长槐琼灯","c_dmk_0043_tap",{"$nulls":4},"r","RareItem","MapPiece",1,null,{"$f":"[2]!SUMSTRING(AD46:AG46,\"_\")","v":{"$error":"#NAME?"}}]
[null,10046,"46","c_ly_0039",{"$nulls":11},205021,"05","2","c_dmk_0043","_slide","c_dmk_0043_slide",null,null,"百卉含英","c_dmk_0043_slide",{"$nulls":4},"r","RareItem","MapPiece",2,null,{"$f":"[2]!SUMSTRING(AD47:AG47,\"_\")","v":{"$error":"#NAME?"}}]
[null,10047,"47","c_cff_0047",{"$nulls":11},205022,"05","2","c_dmk_0043","_slide","c_dmk_0043_slide",null,null,"百卉含英","c_dmk_0043_slide",{"$nulls":4},"r","RareItem","Specail",6,null,{"$f":"[2]!SUMSTRING(AD48:AG48,\"_\")","v":{"$error":"#NAME?"}}]
[null,10048,"48","c_yff_0048",{"$nulls":11},205023,"05","2","c_dmk_0043","_slide","c_dmk_0043_slide",null,null,"百卉含英","c_dmk_0043_slide",{"$nulls":4},"r","RareItem","Specail",7,null,{"$f":"[2]!SUMSTRING(AD49:AG49,\"_\")","v":{"$error":"#NAME?"}}]
[null,10049,"49","c_cff_0049",{"$nulls":11},205024,"05","2","c_dmk_0043","_slide","c_dmk_0043_slide",null,null,"百卉含英","c_dmk_0043_slide",{"$nulls":4},"r","RareMaterial","Rune",1,null,{"$f":"[2]!SUMSTRING(AD50:AG50,\"_\")","v":{"$error":"#NAME?"}}]
[null,10050,"50","c_jff_0050",{"$nulls":11},205025,"05","2","c_dmk_0043","_slide","c_dmk_0043_slide",null,null,"百卉含英","c_dmk_0043_slide",{"$nulls":4},"r","RareMaterial","Rune",2,null,{"$f":"[2]!SUMSTRING(AD51:AG51,\"_\")","v":{"$error":"#NAME?"}}]
[null,10051,"51","c_ym_0051",{"$nulls":11},206011,"06","1","c_qlq_0006","_tap","c_qlq_0006_tap",null,null,"阳炎破阵曲","c_qlq_0006_tap",{"$nulls":4},"r","RareMaterial","Rune",3,null,{"$f":"[2]!SUMSTRING(AD52:AG52,\"_\")","v":{"$error":"#NAME?"}}]
[null,10052,"52","c_ym_0052",{"$nulls":11},206012,"06","1","c_qlq_0006","_tap","c_qlq_0006_tap",null,null,"阳炎破阵曲","c_qlq_0006_tap",{"$nulls":4},"r","Rune","RareMaterial",4,null,{"$f":"[2]!SUMSTRING(AD53:AG53,\"_\")","v":{"$error":"#NAME?"}}]
[{"$nulls":15},206013,"06","1","c_qlq_0006","_tap","c_qlq_0006_tap",null,null,"阳炎破阵曲","c_qlq_0006_tap"]
[{"$nulls":15},206014,"06","1","c_qlq_0006","_tap","c_qlq_0006_tap",null,null,"阳炎破阵曲","c_qlq_0006_tap"]
[{"$nulls":15},206015,"06","1","c_qlq_0006","_tap","c_qlq_0006_tap",null,null,"阳炎破阵曲","c_qlq_0006_tap"]
[{"$nulls":15},206021,"06","2","c_qlq_0006","_slide","c_qlq_0006_slide",null,null,"焚心引","c_qlq_0006_slide"]
[{"$nulls":15},206022,"06","2","c_qlq_0006","_slide","c_qlq_0006_slide",null,null,"焚心引","c_qlq_0006_slide"]
[{"$nulls":15},206023,"06","2","c_qlq_0006","_slide","c_qlq_0006_slide",null,null,"焚心引","c_qlq_0006_slide"]
[{"$nulls":15},206024,"06","2","c_qlq_0006","_slide","c_qlq_0006_slide",null,null,"焚心引","c_qlq_0006_slide"]
[{"$nulls":15},206025,"06","2","c_qlq_0006","_slide","c_qlq_0006_slide",null,null,"焚心引","c_qlq_0006_slide"]
[{"$nulls":15},207011,"07","1","c_jz_0002","_tap","c_jz_0002_tap",null,null,"破甲裂","c_jz_0002_tap"]
[{"$nulls":15},207012,"07","1","c_jz_0002","_tap","c_jz_0002_tap",null,null,"破甲裂","c_jz_0002_tap"]
[{"$nulls":15},207013,"07","1","c_jz_0002","_tap","c_jz_0002_tap",null,null,"破甲裂","c_jz_0002_tap"]
[{"$nulls":15},207014,"07","1","c_jz_0002","_tap","c_jz_0002_tap",null,null,"破甲裂","c_jz_0002_tap"]
[{"$nulls":15},207015,"07","1","c_jz_0002","_tap","c_jz_0002_tap",null,null,"破甲裂","c_jz_0002_tap"]
[{"$nulls":15},207021,{"$f":"MID(P67,2,2)","v":"07"},{"$f":"MID(P67,5,1)","v":"2"},{"$f":"VLOOKUP(Q67,$C$2:$D$53,2,0)","v":"c_jz_0002"},"_slide",{"$f":"S67&T67","v":"c_jz_0002_slide"},null,null,"轮转之海",{"$f":"IF(X67=\"\",\"\",U67)","v":"c_jz_0002_slide"}]
[{"$nulls":15},207022,"07","2","c_jz_0002","_slide","c_jz_0002_slide",null,null,"轮转之海","c_jz_0002_slide"]
[{"$nulls":15},207023,"07","2","c_jz_0002","_slide","c_jz_0002_slide",null,null,"轮转之海","c_jz_0002_slide"]
[{"$nulls":15},207024,"07","2","c_jz_0002","_slide","c_jz_0002_slide",null,null,"轮转之海","c_jz_0002_slide"]
[{"$nulls":15},207025,"07","2","c_jz_0002","_slide","c_jz_0002_slide",null,null,"轮转之海","c_jz_0002_slide"]
[{"$nulls":15},208011,"08","1","c_bmf_0004","_tap","c_bmf_0004_tap",null,null,"幻境之瞳","c_bmf_0004_tap"]
[{"$nulls":15},208012,"08","1","c_bmf_0004","_tap","c_bmf_0004_tap",null,null,"幻境之瞳","c_bmf_0004_tap"]
[{"$nulls":15},208013,"08","1","c_bmf_0004","_tap","c_bmf_0004_tap",null,null,"幻境之瞳","c_bmf_0004_tap"]
[{"$nulls":15},208014,"08","1","c_bmf_0004","_tap","c_bmf_0004_tap",null,null,"幻境之瞳","c_bmf_0004_tap"]
[{"$nulls":15},208015,"08","1","c_bmf_0004","_tap","c_bmf_0004_tap",null,null,"幻境之瞳","c_bmf_0004_tap"]
[{"$nulls":15},208021,"08","2","c_bmf_0004",{"$f":"T67","v":"_slide"},"c_bmf_0004_slide",null,null,"无尽莲塘","c_bmf_0004_slide"]
[{"$nulls":15},208022,"08","2","c_bmf_0004","_slide","c_bmf_0004_slide",null,null,"无尽莲塘","c_bmf_0004_slide"]
[{"$nulls":15},208023,"08","2","c_bmf_0004","_slide","c_bmf_0004_slide",null,null,"无尽莲塘","c_bmf_0004_slide"]
[{"$nulls":15},208024,"08","2","c_bmf_0004","_slide","c_bmf_0004_slide",null,null,"无尽莲塘","c_bmf_0004_slide"]
[{"$nulls":15},208025,"08","2","c_bmf_0004","_slide","c_bmf_0004_slide",null,null,"无尽莲塘","c_bmf_0004_slide"]
[{"$nulls":15},209011,"09","1","c_qf_0046","_tap","c_qf_0046_tap",null,null,"黑符","c_qf_0046_tap"]
[{"$nulls":15},209012,"09","1","c_qf_0046","_tap","c_qf_0046_tap",null,null,"黑符","c_qf_0046_tap"]
[{"$nulls":15},209013,"09","1","c_qf_0046","_tap","c_qf_0046_tap",null,null,"黑符","c_qf_0046_tap"]
[{"$nulls":15},209014,"09","1","c_qf_0046","_tap","c_qf_0046_tap",null,null,"黑符","c_qf_0046_tap"]
[{"$nulls":15},209015,"09","1","c_qf_0046","_tap","c_qf_0046_tap",null,null,"黑符","c_qf_0046_tap"]
[{"$nulls":15},209021,"09","2","c_qf_0046","_slide","c_qf_0046_slide",null,null,"炎冥锁狱","c_qf_0046_slide"]
[{"$nulls":15},209022,"09","2","c_qf_0046","_slide","c_qf_0046_slide",null,null,"炎冥锁狱","c_qf_0046_slide"]
[{"$nulls":15},209023,"09","2","c_qf_0046","_slide","c_qf_0046_slide",null,null,"炎冥锁狱","c_qf_0046_slide"]
[{"$nulls":15},209024,"09","2","c_qf_0046","_slide","c_qf_0046_slide",null,null,"炎冥锁狱","c_qf_0046_slide"]
[{"$nulls":15},209025,"09","2","c_qf_0046","_slide","c_qf_0046_slide",null,null,"炎冥锁狱","c_qf_0046_slide"]
[{"$nulls":15},210011,"10","1","c_yqj_0042","_tap","c_yqj_0042_tap",null,null,"涡流","c_yqj_0042_tap"]
[{"$nulls":15},210012,"10","1","c_yqj_0042","_tap","c_yqj_0042_tap",null,null,"涡流","c_yqj_0042_tap"]
[{"$nulls":15},210013,"10","1","c_yqj_0042","_tap","c_yqj_0042_tap",null,null,"涡流","c_yqj_0042_tap"]
[{"$nulls":15},210014,"10","1","c_yqj_0042","_tap","c_yqj_0042_tap",null,null,"涡流","c_yqj_0042_tap"]
[{"$nulls":15},210015,"10","1","c_yqj_0042","_tap","c_yqj_0042_tap",null,null,"涡流","c_yqj_0042_tap"]
[{"$nulls":15},210021,"10","2","c_yqj_0042","_slide","c_yqj_0042_slide",null,null,"龙兴之潮","c_yqj_0042_slide"]
[{"$nulls":15},210022,"10","2","c_yqj_0042","_slide","c_yqj_0042_slide",null,null,"龙兴之潮","c_yqj_0042_slide"]
[{"$nulls":15},210023,"10","2","c_yqj_0042","_slide","c_yqj_0042_slide",null,null,"龙兴之潮","c_yqj_0042_slide"]
[{"$nulls":15},210024,"10","2","c_yqj_0042","_slide","c_yqj_0042_slide",null,null,"龙兴之潮","c_yqj_0042_slide"]
[{"$nulls":15},210025,"10","2","c_yqj_0042","_slide","c_yqj_0042_slide",null,null,"龙兴之潮","c_yqj_0042_slide"]
[{"$nulls":15},211011,"11","1","c_yy_0041","_tap","c_yy_0041_tap",null,null,"地灵咒","c_yy_0041_tap"]
[{"$nulls":15},211012,"11","1","c_yy_0041","_tap","c_yy_0041_tap",null,null,"地灵咒","c_yy_0041_tap"]
[{"$nulls":15},211013,"11","1","c_yy_0041","_tap","c_yy_0041_tap",null,null,"地灵咒","c_yy_0041_tap"]
[{"$nulls":15},211014,"11","1","c_yy_0041","_tap","c_yy_0041_tap",null,null,"地灵咒","c_yy_0041_tap"]
[{"$nulls":15},211015,"11","1","c_yy_0041","_tap","c_yy_0041_tap",null,null,"地灵咒","c_yy_0041_tap"]
[{"$nulls":15},211021,"11","2","c_yy_0041","_slide","c_yy_0041_slide",null,null,"缚傀诀","c_yy_0041_slide"]
[{"$nulls":15},211022,"11","2","c_yy_0041","_slide","c_yy_0041_slide",null,null,"缚傀诀","c_yy_0041_slide"]
[{"$nulls":15},211023,"11","2","c_yy_0041","_slide","c_yy_0041_slide",null,null,"缚傀诀","c_yy_0041_slide"]
[{"$nulls":15},211024,"11","2","c_yy_0041","_slide","c_yy_0041_slide",null,null,"缚傀诀","c_yy_0041_slide"]
[{"$nulls":15},211025,"11","2","c_yy_0041","_slide","c_yy_0041_slide",null,null,"缚傀诀","c_yy_0041_slide"]
[{"$nulls":15},212011,"12","1","c_mrzq_0010","_tap","c_mrzq_0010_tap",null,null,"焚花","c_mrzq_0010_tap"]
[{"$nulls":15},212012,"12","1","c_mrzq_0010","_tap","c_mrzq_0010_tap",null,null,"焚花","c_mrzq_0010_tap"]
[{"$nulls":15},212013,"12","1","c_mrzq_0010","_tap","c_mrzq_0010_tap",null,null,"焚花","c_mrzq_0010_tap"]
[{"$nulls":15},212014,"12","1","c_mrzq_0010","_tap","c_mrzq_0010_tap",null,null,"焚花","c_mrzq_0010_tap"]
[{"$nulls":15},212015,"12","1","c_mrzq_0010","_tap","c_mrzq_0010_tap",null,null,"焚花","c_mrzq_0010_tap"]
[{"$nulls":15},212021,"12","2","c_mrzq_0010","_slide","c_mrzq_0010_slide",null,null,"断雨","c_mrzq_0010_slide"]
[{"$nulls":15},212022,"12","2","c_mrzq_0010","_slide","c_mrzq_0010_slide",null,null,"断雨","c_mrzq_0010_slide"]
[{"$nulls":15},212023,"12","2","c_mrzq_0010","_slide","c_mrzq_0010_slide",null,null,"断雨","c_mrzq_0010_slide"]
[{"$nulls":15},212024,"12","2","c_mrzq_0010","_slide","c_mrzq_0010_slide",null,null,"断雨","c_mrzq_0010_slide"]
[{"$nulls":15},212025,"12","2","c_mrzq_0010","_slide","c_mrzq_0010_slide",null,null,"断雨","c_mrzq_0010_slide"]
[{"$nulls":15},213011,"13","1","c_yl_0014","_tap","c_yl_0014_tap",null,null,"黑泉利箭","c_yl_0014_tap"]
[{"$nulls":15},213012,"13","1","c_yl_0014","_tap","c_yl_0014_tap",null,null,"黑泉利箭","c_yl_0014_tap"]
[{"$nulls":15},213013,"13","1","c_yl_0014","_tap","c_yl_0014_tap",null,null,"黑泉利箭","c_yl_0014_tap"]
[{"$nulls":15},213014,"13","1","c_yl_0014","_tap","c_yl_0014_tap",null,null,"黑泉利箭","c_yl_0014_tap"]
[{"$nulls":15},213015,"13","1","c_yl_0014","_tap","c_yl_0014_tap",null,null,"黑泉利箭","c_yl_0014_tap"]
[{"$nulls":15},213021,"13","2","c_yl_0014","_slide","c_yl_0014_slide",null,null,"芙蓉箭雨","c_yl_0014_slide"]
[{"$nulls":15},213022,"13","2","c_yl_0014","_slide","c_yl_0014_slide",null,null,"芙蓉箭雨","c_yl_0014_slide"]
[{"$nulls":15},213023,"13","2","c_yl_0014","_slide","c_yl_0014_slide",null,null,"芙蓉箭雨","c_yl_0014_slide"]
[{"$nulls":15},213024,"13","2","c_yl_0014","_slide","c_yl_0014_slide",null,null,"芙蓉箭雨","c_yl_0014_slide"]
[{"$nulls":15},213025,{"$f":"MID(P131,2,2)","v":"13"},{"$f":"MID(P131,5,1)","v":"2"},{"$f":"VLOOKUP(Q131,$C$2:$D$53,2,0)","v":"c_yl_0014"},"_slide",{"$f":"S131&T131","v":"c_yl_0014_slide"},null,null,"芙蓉箭雨",{"$f":"IF(X131=\"\",\"\",U131)","v":"c_yl_0014_slide"}]
[{"$nulls":15},214011,"14","1","c_gt_0001","_tap","c_gt_0001_tap",null,null,"墨意","c_gt_0001_tap"]
[{"$nulls":15},214012,"14","1","c_gt_0001","_tap","c_gt_0001_tap",null,null,"墨意","c_gt_0001_tap"]
[{"$nulls":15},214013,"14","1","c_gt_0001","_tap","c_gt_0001_tap",null,null,"墨意","c_gt_0001_tap"]
[{"$nulls":15},214014,"14","1","c_gt_0001","_tap","c_gt_0001_tap",null,null,"墨意","c_gt_0001_tap"]
[{"$nulls":15},214015,"14","1","c_gt_0001","_tap","c_gt_0001_tap",null,null,"墨意","c_gt_0001_tap"]
[{"$nulls":15},214021,"14","2","c_gt_0001","_slide","c_gt_0001_slide",null,null,"画龙点睛","c_gt_0001_slide"]
[{"$nulls":15},214022,"14","2","c_gt_0001","_slide","c_gt_0001_slide",null,null,"画龙点睛","c_gt_0001_slide"]
[{"$nulls":15},214023,"14","2","c_gt_0001","_slide","c_gt_0001_slide",null,null,"画龙点睛","c_gt_0001_slide"]
[{"$nulls":15},214024,"14","2","c_gt_0001","_slide","c_gt_0001_slide",null,null,"画龙点睛","c_gt_0001_slide"]
[{"$nulls":15},214025,"14","2","c_gt_0001",{"$f":"T131","v":"_slide"},"c_gt_0001_slide",null,null,"画龙点睛","c_gt_0001_slide"]
[{"$nulls":15},215011,"15","1","c_xy_0012","_tap","c_xy_0012_tap",null,null,"辉映","c_xy_0012_tap"]
[{"$nulls":15},215012,"15","1","c_xy_0012","_tap","c_xy_0012_tap",null,null,"辉映","c_xy_0012_tap"]
[{"$nulls":15},215013,"15","1","c_xy_0012","_tap","c_xy_0012_tap",null,null,"辉映","c_xy_0012_tap"]
[{"$nulls":15},215014,"15","1","c_xy_0012","_tap","c_xy_0012_tap",null,null,"辉映","c_xy_0012_tap"]
[{"$nulls":15},215015,"15","1","c_xy_0012","_tap","c_xy_0012_tap",null,null,"辉映","c_xy_0012_tap"]
[{"$nulls":15},215021,"15","2","c_xy_0012","_slide","c_xy_0012_slide",null,null,"幻影预兆","c_xy_0012_slide"]
[{"$nulls":15},215022,"15","2","c_xy_0012","_slide","c_xy_0012_slide",null,null,"幻影预兆","c_xy_0012_slide"]
[{"$nulls":15},215023,"15","2","c_xy_0012","_slide","c_xy_0012_slide",null,null,"幻影预兆","c_xy_0012_slide"]
[{"$nulls":15},215024,"15","2","c_xy_0012","_slide","c_xy_0012_slide",null,null,"幻影预兆","c_xy_0012_slide"]
[{"$nulls":15},215025,"15","2","c_xy_0012","_slide","c_xy_0012_slide",null,null,"幻影预兆","c_xy_0012_slide"]
[{"$nulls":15},216011,"16","1","c_cyh_0008","_tap","c_cyh_0008_tap",null,null,"无明火","c_cyh_0008_tap"]
[{"$nulls":15},216012,"16","1","c_cyh_0008","_tap","c_cyh_0008_tap",null,null,"无明火","c_cyh_0008_tap"]
[{"$nulls":15},216013,"16","1","c_cyh_0008","_tap","c_cyh_0008_tap",null,null,"无明火","c_cyh_0008_tap"]
[{"$nulls":15},216014,"16","1","c_cyh_0008","_tap","c_cyh_0008_tap",null,null,"无明火","c_cyh_0008_tap"]
[{"$nulls":15},216015,"16","1","c_cyh_0008","_tap","c_cyh_0008_tap",null,null,"无明火","c_cyh_0008_tap"]
[{"$nulls":15},216021,"16","2","c_cyh_0008","_slide","c_cyh_0008_slide",null,null,"禁焰觉醒","c_cyh_0008_slide"]
[{"$nulls":15},216022,"16","2","c_cyh_0008","_slide","c_cyh_0008_slide",null,null,"禁焰觉醒","c_cyh_0008_slide"]
[{"$nulls":15},216023,"16","2","c_cyh_0008","_slide","c_cyh_0008_slide",null,null,"禁焰觉醒","c_cyh_0008_slide"]
[{"$nulls":15},216024,"16","2","c_cyh_0008","_slide","c_cyh_0008_slide",null,null,"禁焰觉醒","c_cyh_0008_slide"]
[{"$nulls":15},216025,"16","2","c_cyh_0008","_slide","c_cyh_0008_slide",null,null,"禁焰觉醒","c_cyh_0008_slide"]
[{"$nulls":15},217011,"17","1","c_sxdw_0053","_tap","c_sxdw_0053_tap",null,null,"晦影","c_sxdw_0053_tap"]
[{"$nulls":15},217012,"17","1","c_sxdw_0053","_tap","c_sxdw_0053_tap",null,null,"晦影","c_sxdw_0053_tap"]
[{"$nulls":15},217013,"17","1","c_sxdw_0053","_tap","c_sxdw_0053_tap",null,null,"晦影","c_sxdw_0053_tap"]
[{"$nulls":15},217014,"17","1","c_sxdw_0053","_tap","c_sxdw_0053_tap",null,null,"晦影","c_sxdw_0053_tap"]
[{"$nulls":15},217015,"17","1","c_sxdw_0053","_tap","c_sxdw_0053_tap",null,null,"晦影","c_sxdw_0053_tap"]
[{"$nulls":15},217021,"17","2","c_sxdw_0053","_slide","c_sxdw_0053_slide",null,null,"常世之暗","c_sxdw_0053_slide"]
[{"$nulls":15},217022,"17","2","c_sxdw_0053","_slide","c_sxdw_0053_slide",null,null,"常世之暗","c_sxdw_0053_slide"]
[{"$nulls":15},217023,"17","2","c_sxdw_0053","_slide","c_sxdw_0053_slide",null,null,"常世之暗","c_sxdw_0053_slide"]
[{"$nulls":15},217024,"17","2","c_sxdw_0053","_slide","c_sxdw_0053_slide",null,null,"常世之暗","c_sxdw_0053_slide"]
[{"$nulls":15},217025,"17","2","c_sxdw_0053","_slide","c_sxdw_0053_slide",null,null,"常世之暗","c_sxdw_0053_slide"]
[{"$nulls":15},218011,"18","1","c_zh_0044","_tap","c_zh_0044_tap",null,null,"天照","c_zh_0044_tap"]
[{"$nulls":15},218012,"18","1","c_zh_0044","_tap","c_zh_0044_tap",null,null,"天照","c_zh_0044_tap"]
[{"$nulls":15},218013,"18","1","c_zh_0044","_tap","c_zh_0044_tap",null,null,"天照","c_zh_0044_tap"]
[{"$nulls":15},218014,"18","1","c_zh_0044","_tap","c_zh_0044_tap",null,null,"天照","c_zh_0044_tap"]
[{"$nulls":15},218015,"18","1","c_zh_0044","_tap","c_zh_0044_tap",null,null,"天照","c_zh_0044_tap"]
[{"$nulls":15},218021,"18","2","c_zh_0044","_slide","c_zh_0044_slide",null,null,"剜心刺骨","c_zh_0044_slide"]
[{"$nulls":15},218022,"18","2","c_zh_0044","_slide","c_zh_0044_slide",null,null,"剜心刺骨","c_zh_0044_slide"]
[{"$nulls":15},218023,"18","2","c_zh_0044","_slide","c_zh_0044_slide",null,null,"剜心刺骨","c_zh_0044_slide"]
[{"$nulls":15},218024,"18","2","c_zh_0044","_slide","c_zh_0044_slide",null,null,"剜心刺骨","c_zh_0044_slide"]
[{"$nulls":15},218025,"18","2","c_zh_0044","_slide","c_zh_0044_slide",null,null,"剜心刺骨","c_zh_0044_slide"]
[{"$nulls":15},219011,"19","1","c_kq_0018","_tap","c_kq_0018_tap",null,null,"辰变","c_kq_0018_tap"]
[{"$nulls":15},219012,"19","1","c_kq_0018","_tap","c_kq_0018_tap",null,null,"辰变","c_kq_0018_tap"]
[{"$nulls":15},219013,"19","1","c_kq_0018","_tap","c_kq_0018_tap",null,null,"辰变","c_kq_0018_tap"]
[{"$nulls":15},219014,"19","1","c_kq_0018","_tap","c_kq_0018_tap",null,null,"辰变","c_kq_0018_tap"]
[{"$nulls":15},219015,"19","1","c_kq_0018","_tap","c_kq_0018_tap",null,null,"辰变","c_kq_0018_tap"]
[{"$nulls":15},219021,"19","2","c_kq_0018","_slide","c_kq_0018_slide",null,null,"凭虚御风","c_kq_0018_slide"]
[{"$nulls":15},219022,"19","2","c_kq_0018","_slide","c_kq_0018_slide",null,null,"凭虚御风","c_kq_0018_slide"]
[{"$nulls":15},219023,"19","2","c_kq_0018","_slide","c_kq_0018_slide",null,null,"凭虚御风","c_kq_0018_slide"]
[{"$nulls":15},219024,"19","2","c_kq_0018","_slide","c_kq_0018_slide",null,null,"凭虚御风","c_kq_0018_slide"]
[{"$nulls":15},219025,"19","2","c_kq_0018","_slide","c_kq_0018_slide",null,null,"凭虚御风","c_kq_0018_slide"]
[{"$nulls":15},220011,"20","1","c_ywy_0040","_tap","c_ywy_0040_tap",null,null,"天回","c_ywy_0040_tap"]
[{"$nulls":15},220012,"20","1","c_ywy_0040","_tap","c_ywy_0040_tap",null,null,"天回","c_ywy_0040_tap"]
[{"$nulls":15},220013,"20","1","c_ywy_0040","_tap","c_ywy_0040_tap",null,null,"天回","c_ywy_0040_tap"]
[{"$nulls":15},220014,{"$f":"MID(P195,2,2)","v":"20"},{"$f":"MID(P195,5,1)","v":"1"},{"$f":"VLOOKUP(Q195,$C$2:$D$53,2,0)","v":"c_ywy_0040"},"_tap",{"$f":"S195&T195","v":"c_ywy_0040_tap"},null,null,"天回",{"$f":"IF(X195=\"\",\"\",U195)","v":"c_ywy_0040_tap"}]
[{"$nulls":15},220015,"20","1","c_ywy_0040","_tap","c_ywy_0040_tap",null,null,"天回","c_ywy_0040_tap"]
[{"$nulls":15},220021,"20","2","c_ywy_0040","_slide","c_ywy_0040_slide",null,null,"白炎离火","c_ywy_0040_slide"]
[{"$nulls":15},220022,"20","2","c_ywy_0040","_slide","c_ywy_0040_slide",null,null,"白炎离火","c_ywy_0040_slide"]
[{"$nulls":15},220023,"20","2","c_ywy_0040","_slide","c_ywy_0040_slide",null,null,"白炎离火","c_ywy_0040_slide"]
[{"$nulls":15},220024,"20","2","c_ywy_0040","_slide","c_ywy_0040_slide",null,null,"白炎离火","c_ywy_0040_slide"]
[{"$nulls":15},220025,"20","2","c_ywy_0040","_slide","c_ywy_0040_slide",null,null,"白炎离火","c_ywy_0040_slide"]
[{"$nulls":15},221011,"21","1","c_mlmn_0054","_tap","c_mlmn_0054_tap",null,null,"水玉缚灵","c_mlmn_0054_tap"]
[{"$nulls":15},221012,"21","1","c_mlmn_0054","_tap","c_mlmn_0054_tap",null,null,"水玉缚灵","c_mlmn_0054_tap"]
[{"$nulls":15},221013,"21","1","c_mlmn_0054","_tap","c_mlmn_0054_tap",null,null,"水玉缚灵","c_mlmn_0054_tap"]
[{"$nulls":15},221014,"21","1","c_mlmn_0054",{"$f":"T195","v":"_tap"},"c_mlmn_0054_tap",null,null,"水玉缚灵","c_mlmn_0054_tap"]
[{"$nulls":15},221015,"21","1","c_mlmn_0054","_tap","c_mlmn_0054_tap",null,null,"水玉缚灵","c_mlmn_0054_tap"]
[{"$nulls":15},221021,"21","2","c_mlmn_0054","_slide","c_mlmn_0054_slide",null,null,"深渊流葬","c_mlmn_0054_slide"]
[{"$nulls":15},221022,"21","2","c_mlmn_0054","_slide","c_mlmn_0054_slide",null,null,"深渊流葬","c_mlmn_0054_slide"]
[{"$nulls":15},221023,"21","2","c_mlmn_0054","_slide","c_mlmn_0054_slide",null,null,"深渊流葬","c_mlmn_0054_slide"]
[{"$nulls":15},221024,"21","2","c_mlmn_0054","_slide","c_mlmn_0054_slide",null,null,"深渊流葬","c_mlmn_0054_slide"]
[{"$nulls":15},221025,"21","2","c_mlmn_0054","_slide","c_mlmn_0054_slide",null,null,"深渊流葬","c_mlmn_0054_slide"]
[{"$nulls":15},222011,"22","1","c_ywg_0045","_tap","c_ywg_0045_tap",null,null,"煞气","c_ywg_0045_tap"]
[{"$nulls":15},222012,"22","1","c_ywg_0045","_tap","c_ywg_0045_tap",null,null,"煞气","c_ywg_0045_tap"]
[{"$nulls":15},222013,"22","1","c_ywg_0045","_tap","c_ywg_0045_tap",null,null,"煞气","c_ywg_0045_tap"]
[{"$nulls":15},222014,"22","1","c_ywg_0045","_tap","c_ywg_0045_tap",null,null,"煞气","c_ywg_0045_tap"]
[{"$nulls":15},222015,"22","1","c_ywg_0045","_tap","c_ywg_0045_tap",null,null,"煞气","c_ywg_0045_tap"]
[{"$nulls":15},222021,"22","2","c_ywg_0045","_slide","c_ywg_0045_slide",null,null,"侵风摧魂","c_ywg_0045_slide"]
[{"$nulls":15},222022,"22","2","c_ywg_0045","_slide","c_ywg_0045_slide",null,null,"侵风摧魂","c_ywg_0045_slide"]
[{"$nulls":15},222023,"22","2","c_ywg_0045","_slide","c_ywg_0045_slide",null,null,"侵风摧魂","c_ywg_0045_slide"]
[{"$nulls":15},222024,"22","2","c_ywg_0045","_slide","c_ywg_0045_slide",null,null,"侵风摧魂","c_ywg_0045_slide"]
[{"$nulls":15},222025,"22","2","c_ywg_0045","_slide","c_ywg_0045_slide",null,null,"侵风摧魂","c_ywg_0045_slide"]
[{"$nulls":15},223011,"23","1","c_y_0013","_tap","c_y_0013_tap",null,null,"雷罚","c_y_0013_tap"]
[{"$nulls":15},223012,"23","1","c_y_0013","_tap","c_y_0013_tap",null,null,"雷罚","c_y_0013_tap"]
[{"$nulls":15},223013,"23","1","c_y_0013","_tap","c_y_0013_tap",null,null,"雷罚","c_y_0013_tap"]
[{"$nulls":15},223014,"23","1","c_y_0013","_tap","c_y_0013_tap",null,null,"雷罚","c_y_0013_tap"]
[{"$nulls":15},223015,"23","1","c_y_0013","_tap","c_y_0013_tap",null,null,"雷罚","c_y_0013_tap"]
[{"$nulls":15},223021,"23","2","c_y_0013","_slide","c_y_0013_slide",null,null,"苍穹天雷","c_y_0013_slide"]
[{"$nulls":15},223022,"23","2","c_y_0013","_slide","c_y_0013_slide",null,null,"苍穹天雷","c_y_0013_slide"]
[{"$nulls":15},223023,"23","2","c_y_0013","_slide","c_y_0013_slide",null,null,"苍穹天雷","c_y_0013_slide"]
[{"$nulls":15},223024,"23","2","c_y_0013","_slide","c_y_0013_slide",null,null,"苍穹天雷","c_y_0013_slide"]
[{"$nulls":15},223025,"23","2","c_y_0013","_slide","c_y_0013_slide",null,null,"苍穹天雷","c_y_0013_slide"]
[{"$nulls":15},224011,"24","1","c_xjr_0003","_tap","c_xjr_0003_tap",null,null,"风烈打","c_xjr_0003_tap"]
[{"$nulls":15},224012,"24","1","c_xjr_0003","_tap","c_xjr_0003_tap",null,null,"风烈打","c_xjr_0003_tap"]
[{"$nulls":15},224013,"24","1","c_xjr_0003","_tap","c_xjr_0003_tap",null,null,"风烈打","c_xjr_0003_tap"]
[{"$nulls":15},224014,"24","1","c_xjr_0003","_tap","c_xjr_0003_tap",null,null,"风烈打","c_xjr_0003_tap"]
[{"$nulls":15},224015,"24","1","c_xjr_0003","_tap","c_xjr_0003_tap",null,null,"风烈打","c_xjr_0003_tap"]
[{"$nulls":15},224021,"24","2","c_xjr_0003","_slide","c_xjr_0003_slide",{"$nulls":3},""]
[{"$nulls":15},224022,"24","2","c_xjr_0003","_slide","c_xjr_0003_slide",{"$nulls":3},""]
[{"$nulls":15},224023,"24","2","c_xjr_0003","_slide","c_xjr_0003_slide",{"$nulls":3},""]
[{"$nulls":15},224024,"24","2","c_xjr_0003","_slide","c_xjr_0003_slide",{"$nulls":3},""]
[{"$nulls":15},224025,"24","2","c_xjr_0003","_slide","c_xjr_0003_slide",{"$nulls":3},""]
[{"$nulls":15},225011,"25","1","c_tx_0011","_tap","c_tx_0011_tap",null,null,"宣火符","c_tx_0011_tap"]
[{"$nulls":15},225012,"25","1","c_tx_0011","_tap","c_tx_0011_tap",null,null,"宣火符","c_tx_0011_tap"]
[{"$nulls":15},225013,"25","1","c_tx_0011","_tap","c_tx_0011_tap",null,null,"宣火符","c_tx_0011_tap"]
[{"$nulls":15},225014,"25","1","c_tx_0011","_tap","c_tx_0011_tap",null,null,"宣火符","c_tx_0011_tap"]
[{"$nulls":15},225015,"25","1","c_tx_0011","_tap","c_tx_0011_tap",null,null,"宣火符","c_tx_0011_tap"]
[{"$nulls":15},225021,"25","2","c_tx_0011","_slide","c_tx_0011_slide",{"$nulls":3},""]
[{"$nulls":15},225022,"25","2","c_tx_0011","_slide","c_tx_0011_slide",{"$nulls":3},""]
[{"$nulls":15},225023,"25","2","c_tx_0011","_slide","c_tx_0011_slide",{"$nulls":3},""]
[{"$nulls":15},225024,"25","2","c_tx_0011","_slide","c_tx_0011_slide",{"$nulls":3},""]
[{"$nulls":15},225025,"25","2","c_tx_0011","_slide","c_tx_0011_slide",{"$nulls":3},""]
[{"$nulls":15},226011,"26","1","c_sq_0019","_tap","c_sq_0019_tap",null,null,"敲山震虎","c_sq_0019_tap"]
[{"$nulls":15},226012,"26","1","c_sq_0019","_tap","c_sq_0019_tap",null,null,"敲山震虎","c_sq_0019_tap"]
[{"$nulls":15},226013,"26","1","c_sq_0019","_tap","c_sq_0019_tap",null,null,"敲山震虎","c_sq_0019_tap"]
[{"$nulls":15},226014,"26","1","c_sq_0019","_tap","c_sq_0019_tap",null,null,"敲山震虎","c_sq_0019_tap"]
[{"$nulls":15},226015,"26","1","c_sq_0019","_tap","c_sq_0019_tap",null,null,"敲山震虎","c_sq_0019_tap"]
[{"$nulls":15},226021,"26","2","c_sq_0019","_slide","c_sq_0019_slide",null,null,"崩雷式","c_sq_0019_slide"]
[{"$nulls":15},226022,"26","2","c_sq_0019","_slide","c_sq_0019_slide",null,null,"崩雷式","c_sq_0019_slide"]
[{"$nulls":15},226023,{"$f":"MID(P259,2,2)","v":"26"},{"$f":"MID(P259,5,1)","v":"2"},{"$f":"VLOOKUP(Q259,$C$2:$D$53,2,0)","v":"c_sq_0019"},"_slide",{"$f":"S259&T259","v":"c_sq_0019_slide"},null,null,"崩雷式",{"$f":"IF(X259=\"\",\"\",U259)","v":"c_sq_0019_slide"}]
[{"$nulls":15},226024,"26","2","c_sq_0019","_slide","c_sq_0019_slide",null,null,"崩雷式","c_sq_0019_slide"]
[{"$nulls":15},226025,"26","2","c_sq_0019","_slide","c_sq_0019_slide",null,null,"崩雷式","c_sq_0019_slide"]
[{"$nulls":15},227011,"27","1","c_nye_0020","_tap","c_nye_0020_tap",null,null,"应援","c_nye_0020_tap"]
[{"$nulls":15},227012,"27","1","c_nye_0020","_tap","c_nye_0020_tap",null,null,"应援","c_nye_0020_tap"]
[{"$nulls":15},227013,"27","1","c_nye_0020","_tap","c_nye_0020_tap",null,null,"应援","c_nye_0020_tap"]
[{"$nulls":15},227014,"27","1","c_nye_0020","_tap","c_nye_0020_tap",null,null,"应援","c_nye_0020_tap"]
[{"$nulls":15},227015,"27","1","c_nye_0020","_tap","c_nye_0020_tap",null,null,"应援","c_nye_0020_tap"]
[{"$nulls":15},227021,"27","2","c_nye_0020","_slide","c_nye_0020_slide",null,null,"兔兔拳","c_nye_0020_slide"]
[{"$nulls":15},227022,"27","2","c_nye_0020","_slide","c_nye_0020_slide",null,null,"兔兔拳","c_nye_0020_slide"]
[{"$nulls":15},227023,"27","2","c_nye_0020",{"$f":"T259","v":"_slide"},"c_nye_0020_slide",null,null,"兔兔拳","c_nye_0020_slide"]
[{"$nulls":15},227024,"27","2","c_nye_0020","_slide","c_nye_0020_slide",null,null,"兔兔拳","c_nye_0020_slide"]
[{"$nulls":15},227025,"27","2","c_nye_0020","_slide","c_nye_0020_slide",null,null,"兔兔拳","c_nye_0020_slide"]
[{"$nulls":15},228011,"28","1","c_zc_0021","_tap","c_zc_0021_tap",null,null,"落英之舞","c_zc_0021_tap"]
[{"$nulls":15},228012,"28","1","c_zc_0021","_tap","c_zc_0021_tap",null,null,"落英之舞","c_zc_0021_tap"]
[{"$nulls":15},228013,"28","1","c_zc_0021","_tap","c_zc_0021_tap",null,null,"落英之舞","c_zc_0021_tap"]
[{"$nulls":15},228014,"28","1","c_zc_0021","_tap","c_zc_0021_tap",null,null,"落英之舞","c_zc_0021_tap"]
[{"$nulls":15},228015,"28","1","c_zc_0021","_tap","c_zc_0021_tap",null,null,"落英之舞","c_zc_0021_tap"]
[{"$nulls":15},228021,"28","2","c_zc_0021","_slide","c_zc_0021_slide",null,null,"月舞灵息","c_zc_0021_slide"]
[{"$nulls":15},228022,"28","2","c_zc_0021","_slide","c_zc_0021_slide",null,null,"月舞灵息","c_zc_0021_slide"]
[{"$nulls":15},228023,"28","2","c_zc_0021","_slide","c_zc_0021_slide",null,null,"月舞灵息","c_zc_0021_slide"]
[{"$nulls":15},228024,"28","2","c_zc_0021","_slide","c_zc_0021_slide",null,null,"月舞灵息","c_zc_0021_slide"]
[{"$nulls":15},228025,"28","2","c_zc_0021","_slide","c_zc_0021_slide",null,null,"月舞灵息","c_zc_0021_slide"]
[{"$nulls":15},229011,"29","1","c_lhmn_0056","_tap","c_lhmn_0056_tap",null,null,"昙华动地","c_lhmn_0056_tap"]
[{"$nulls":15},229012,"29","1","c_lhmn_0056","_tap","c_lhmn_0056_tap",null,null,"昙华动地","c_lhmn_0056_tap"]
[{"$nulls":15},229013,"29","1","c_lhmn_0056","_tap","c_lhmn_0056_tap",null,null,"昙华动地","c_lhmn_0056_tap"]
[{"$nulls":15},229014,"29","1","c_lhmn_0056","_tap","c_lhmn_0056_tap",null,null,"昙华动地","c_lhmn_0056_tap"]
[{"$nulls":15},229015,"29","1","c_lhmn_0056","_tap","c_lhmn_0056_tap",null,null,"昙华动地","c_lhmn_0056_tap"]
[{"$nulls":15},229021,"29","2","c_lhmn_0056","_slide","c_lhmn_0056_slide",{"$nulls":3},""]
[{"$nulls":15},229022,"29","2","c_lhmn_0056","_slide","c_lhmn_0056_slide",{"$nulls":3},""]
[{"$nulls":15},229023,"29","2","c_lhmn_0056","_slide","c_lhmn_0056_slide",{"$nulls":3},""]
[{"$nulls":15},229024,"29","2","c_lhmn_0056","_slide","c_lhmn_0056_slide",{"$nulls":3},""]
[{"$nulls":15},229025,"29","2","c_lhmn_0056","_slide","c_lhmn_0056_slide",{"$nulls":3},""]
[{"$nulls":15},230011,"30","1","c_yy_0023","_tap","c_yy_0023_tap",null,null,"碧砂","c_yy_0023_tap"]
[{"$nulls":15},230012,"30","1","c_yy_0023","_tap","c_yy_0023_tap",null,null,"碧砂","c_yy_0023_tap"]
[{"$nulls":15},230013,"30","1","c_yy_0023","_tap","c_yy_0023_tap",null,null,"碧砂","c_yy_0023_tap"]
[{"$nulls":15},230014,"30","1","c_yy_0023","_tap","c_yy_0023_tap",null,null,"碧砂","c_yy_0023_tap"]
[{"$nulls":15},230015,"30","1","c_yy_0023","_tap","c_yy_0023_tap",null,null,"碧砂","c_yy_0023_tap"]
[{"$nulls":15},230021,"30","2","c_yy_0023","_slide","c_yy_0023_slide",{"$nulls":3},""]
[{"$nulls":15},230022,"30","2","c_yy_0023","_slide","c_yy_0023_slide",{"$nulls":3},""]
[{"$nulls":15},230023,"30","2","c_yy_0023","_slide","c_yy_0023_slide",{"$nulls":3},""]
[{"$nulls":15},230024,"30","2","c_yy_0023","_slide","c_yy_0023_slide",{"$nulls":3},""]
[{"$nulls":15},230025,"30","2","c_yy_0023","_slide","c_yy_0023_slide",{"$nulls":3},""]
[{"$nulls":15},231011,"31","1","c_jpw_0024","_tap","c_jpw_0024_tap",null,null,"破邪二连","c_jpw_0024_tap"]
[{"$nulls":15},231012,"31","1","c_jpw_0024","_tap","c_jpw_0024_tap",null,null,"破邪二连","c_jpw_0024_tap"]
[{"$nulls":15},231013,"31","1","c_jpw_0024","_tap","c_jpw_0024_tap",null,null,"破邪二连","c_jpw_0024_tap"]
[{"$nulls":15},231014,"31","1","c_jpw_0024","_tap","c_jpw_0024_tap",null,null,"破邪二连","c_jpw_0024_tap"]
[{"$nulls":15},231015,"31","1","c_jpw_0024","_tap","c_jpw_0024_tap",null,null,"破邪二连","c_jpw_0024_tap"]
[{"$nulls":15},231021,"31","2","c_jpw_0024","_slide","c_jpw_0024_slide",{"$nulls":3},""]
[{"$nulls":15},231022,"31","2","c_jpw_0024","_slide","c_jpw_0024_slide",{"$nulls":3},""]
[{"$nulls":15},231023,"31","2","c_jpw_0024","_slide","c_jpw_0024_slide",{"$nulls":3},""]
[{"$nulls":15},231024,"31","2","c_jpw_0024","_slide","c_jpw_0024_slide",{"$nulls":3},""]
[{"$nulls":15},231025,"31","2","c_jpw_0024","_slide","c_jpw_0024_slide",{"$nulls":3},""]
[{"$nulls":15},232011,"32","1","c_ly_0025","_tap","c_ly_0025_tap",null,null,"天雷地火","c_ly_0025_tap"]
[{"$nulls":15},232012,"32","1","c_ly_0025","_tap","c_ly_0025_tap",null,null,"天雷地火","c_ly_0025_tap"]
[{"$nulls":15},232013,"32","1","c_ly_0025","_tap","c_ly_0025_tap",null,null,"天雷地火","c_ly_0025_tap"]
[{"$nulls":15},232014,"32","1","c_ly_0025","_tap","c_ly_0025_tap",null,null,"天雷地火","c_ly_0025_tap"]
[{"$nulls":15},232015,"32","1","c_ly_0025","_tap","c_ly_0025_tap",null,null,"天雷地火","c_ly_0025_tap"]
[{"$nulls":15},232021,"32","2","c_ly_0025","_slide","c_ly_0025_slide",{"$nulls":3},""]
[{"$nulls":15},232022,"32","2","c_ly_0025","_slide","c_ly_0025_slide",{"$nulls":3},""]
[{"$nulls":15},232023,"32","2","c_ly_0025","_slide","c_ly_0025_slide",{"$nulls":3},""]
[{"$nulls":15},232024,"32","2","c_ly_0025","_slide","c_ly_0025_slide",{"$nulls":3},""]
[{"$nulls":15},232025,"32","2","c_ly_0025","_slide","c_ly_0025_slide",{"$nulls":3},""]
[{"$nulls":15},233011,"33","1","c_xy_0026","_tap","c_xy_0026_tap",null,null,"隐遁","c_xy_0026_tap"]
[{"$nulls":15},233012,{"$f":"MID(P323,2,2)","v":"33"},{"$f":"MID(P323,5,1)","v":"1"},{"$f":"VLOOKUP(Q323,$C$2:$D$53,2,0)","v":"c_xy_0026"},"_tap",{"$f":"S323&T323","v":"c_xy_0026_tap"},null,null,"隐遁",{"$f":"IF(X323=\"\",\"\",U323)","v":"c_xy_0026_tap"}]
[{"$nulls":15},233013,"33","1","c_xy_0026","_tap","c_xy_0026_tap",null,null,"隐遁","c_xy_0026_tap"]
[{"$nulls":15},233014,"33","1","c_xy_0026","_tap","c_xy_0026_tap",null,null,"隐遁","c_xy_0026_tap"]
[{"$nulls":15},233015,"33","1","c_xy_0026","_tap","c_xy_0026_tap",null,null,"隐遁","c_xy_0026_tap"]
[{"$nulls":15},233021,"33","2","c_xy_0026","_slide","c_xy_0026_slide",{"$nulls":3},""]
[{"$nulls":15},233022,"33","2","c_xy_0026","_slide","c_xy_0026_slide",{"$nulls":3},""]
[{"$nulls":15},233023,"33","2","c_xy_0026","_slide","c_xy_0026_slide",{"$nulls":3},""]
[{"$nulls":15},233024,"33","2","c_xy_0026","_slide","c_xy_0026_slide",{"$nulls":3},""]
[{"$nulls":15},233025,"33","2","c_xy_0026","_slide","c_xy_0026_slide",{"$nulls":3},""]
[{"$nulls":15},234011,"34","1","c_fm_0027","_tap","c_fm_0027_tap",null,null,"辟魂","c_fm_0027_tap"]
[{"$nulls":15},234012,"34","1","c_fm_0027",{"$f":"T323","v":"_tap"},"c_fm_0027_tap",null,null,"辟魂","c_fm_0027_tap"]
[{"$nulls":15},234013,"34","1","c_fm_0027","_tap","c_fm_0027_tap",null,null,"辟魂","c_fm_0027_tap"]
[{"$nulls":15},234014,"34","1","c_fm_0027","_tap","c_fm_0027_tap",null,null,"辟魂","c_fm_0027_tap"]
[{"$nulls":15},234015,"34","1","c_fm_0027","_tap","c_fm_0027_tap",null,null,"辟魂","c_fm_0027_tap"]
[{"$nulls":15},234021,"34","2","c_fm_0027","_slide","c_fm_0027_slide",null,null,"夺形之雾","c_fm_0027_slide"]
[{"$nulls":15},234022,"34","2","c_fm_0027","_slide","c_fm_0027_slide",null,null,"夺形之雾","c_fm_0027_slide"]
[{"$nulls":15},234023,"34","2","c_fm_0027","_slide","c_fm_0027_slide",null,null,"夺形之雾","c_fm_0027_slide"]
[{"$nulls":15},234024,"34","2","c_fm_0027","_slide","c_fm_0027_slide",null,null,"夺形之雾","c_fm_0027_slide"]
[{"$nulls":15},234025,"34","2","c_fm_0027","_slide","c_fm_0027_slide",null,null,"夺形之雾","c_fm_0027_slide"]
[{"$nulls":15},235011,"35","1","c_skr_0028","_tap","c_skr_0028_tap",null,null,"血影迷踪","c_skr_0028_tap"]
[{"$nulls":15},235012,"35","1","c_skr_0028","_tap","c_skr_0028_tap",null,null,"血影迷踪","c_skr_0028_tap"]
[{"$nulls":15},235013,"35","1","c_skr_0028","_tap","c_skr_0028_tap",null,null,"血影迷踪","c_skr_0028_tap"]
[{"$nulls":15},235014,"35","1","c_skr_0028","_tap","c_skr_0028_tap",null,null,"血影迷踪","c_skr_0028_tap"]
[{"$nulls":15},235015,"35","1","c_skr_0028","_tap","c_skr_0028_tap",null,null,"血影迷踪","c_skr_0028_tap"]
[{"$nulls":15},235021,"35","2","c_skr_0028","_slide","c_skr_0028_slide",null,null,"沥血诛心","c_skr_0028_slide"]
[{"$nulls":15},235022,"35","2","c_skr_0028","_slide","c_skr_0028_slide",null,null,"沥血诛心","c_skr_0028_slide"]
[{"$nulls":15},235023,"35","2","c_skr_0028","_slide","c_skr_0028_slide",null,null,"沥血诛心","c_skr_0028_slide"]
[{"$nulls":15},235024,"35","2","c_skr_0028","_slide","c_skr_0028_slide",null,null,"沥血诛心","c_skr_0028_slide"]
[{"$nulls":15},235025,"35","2","c_skr_0028","_slide","c_skr_0028_slide",null,null,"沥血诛心","c_skr_0028_slide"]
[{"$nulls":15},236011,"36","1","c_jy_0029","_tap","c_jy_0029_tap",null,null,"深海冥灵","c_jy_0029_tap"]
[{"$nulls":15},236012,"36","1","c_jy_0029","_tap","c_jy_0029_tap",null,null,"深海冥灵","c_jy_0029_tap"]
[{"$nulls":15},236013,"36","1","c_jy_0029","_tap","c_jy_0029_tap",null,null,"深海冥灵","c_jy_0029_tap"]
[{"$nulls":15},236014,"36","1","c_jy_0029","_tap","c_jy_0029_tap",null,null,"深海冥灵","c_jy_0029_tap"]
[{"$nulls":15},236015,"36","1","c_jy_0029","_tap","c_jy_0029_tap",null,null,"深海冥灵","c_jy_0029_tap"]
[{"$nulls":15},236021,"36","2","c_jy_0029","_slide","c_jy_0029_slide",{"$nulls":3},""]
[{"$nulls":15},236022,"36","2","c_jy_0029","_slide","c_jy_0029_slide",{"$nulls":3},""]
[{"$nulls":15},236023,"36","2","c_jy_0029","_slide","c_jy_0029_slide",{"$nulls":3},""]
[{"$nulls":15},236024,"36","2","c_jy_0029","_slide","c_jy_0029_slide",{"$nulls":3},""]
[{"$nulls":15},236025,"36","2","c_jy_0029","_slide","c_jy_0029_slide",{"$nulls":3},""]
[{"$nulls":15},237011,"37","1","c_xl_0030","_tap","c_xl_0030_tap",null,null,"凝霜箭","c_xl_0030_tap"]
[{"$nulls":15},237012,"37","1","c_xl_0030","_tap","c_xl_0030_tap",null,null,"凝霜箭","c_xl_0030_tap"]
[{"$nulls":15},237013,"37","1","c_xl_0030","_tap","c_xl_0030_tap",null,null,"凝霜箭","c_xl_0030_tap"]
[{"$nulls":15},237014,"37","1","c_xl_0030","_tap","c_xl_0030_tap",null,null,"凝霜箭","c_xl_0030_tap"]
[{"$nulls":15},237015,"37","1","c_xl_0030","_tap","c_xl_0030_tap",null,null,"凝霜箭","c_xl_0030_tap"]
[{"$nulls":15},237021,"37","2","c_xl_0030","_slide","c_xl_0030_slide",{"$nulls":3},""]
[{"$nulls":15},237022,"37","2","c_xl_0030","_slide","c_xl_0030_slide",{"$nulls":3},""]
[{"$nulls":15},237023,"37","2","c_xl_0030","_slide","c_xl_0030_slide",{"$nulls":3},""]
[{"$nulls":15},237024,"37","2","c_xl_0030","_slide","c_xl_0030_slide",{"$nulls":3},""]
[{"$nulls":15},237025,"37","2","c_xl_0030","_slide","c_xl_0030_slide",{"$nulls":3},""]
[{"$nulls":15},238011,"38","1","c_cs_0031","_tap","c_cs_0031_tap",null,null,"火相炎流","c_cs_0031_tap"]
[{"$nulls":15},238012,"38","1","c_cs_0031","_tap","c_cs_0031_tap",null,null,"火相炎流","c_cs_0031_tap"]
[{"$nulls":15},238013,"38","1","c_cs_0031","_tap","c_cs_0031_tap",null,null,"火相炎流","c_cs_0031_tap"]
[{"$nulls":15},238014,"38","1","c_cs_0031","_tap","c_cs_0031_tap",null,null,"火相炎流","c_cs_0031_tap"]
[{"$nulls":15},238015,"38","1","c_cs_0031","_tap","c_cs_0031_tap",null,null,"火相炎流","c_cs_0031_tap"]
[{"$nulls":15},238021,"38","2","c_cs_0031","_slide","c_cs_0031_slide",{"$nulls":3},""]
[{"$nulls":15},238022,"38","2","c_cs_0031","_slide","c_cs_0031_slide",{"$nulls":3},""]
[{"$nulls":15},238023,"38","2","c_cs_0031","_slide","c_cs_0031_slide",{"$nulls":3},""]
[{"$nulls":15},238024,"38","2","c_cs_0031","_slide","c_cs_0031_slide",{"$nulls":3},""]
[{"$nulls":15},238025,"38","2","c_cs_0031","_slide","c_cs_0031_slide",{"$nulls":3},""]
[{"$nulls":15},239011,"39","1","c_hyt_0032","_tap","c_hyt_0032_tap",null,null,"寒芒刺","c_hyt_0032_tap"]
[{"$nulls":15},239012,"39","1","c_hyt_0032","_tap","c_hyt_0032_tap",null,null,"寒芒刺","c_hyt_0032_tap"]
[{"$nulls":15},239013,"39","1","c_hyt_0032","_tap","c_hyt_0032_tap",null,null,"寒芒刺","c_hyt_0032_tap"]
[{"$nulls":15},239014,"39","1","c_hyt_0032","_tap","c_hyt_0032_tap",null,null,"寒芒刺","c_hyt_0032_tap"]
[{"$nulls":15},239015,"39","1","c_hyt_0032","_tap","c_hyt_0032_tap",null,null,"寒芒刺","c_hyt_0032_tap"]
[{"$nulls":15},239021,{"$f":"MID(P387,2,2)","v":"39"},{"$f":"MID(P387,5,1)","v":"2"},{"$f":"VLOOKUP(Q387,$C$2:$D$53,2,0)","v":"c_hyt_0032"},"_slide",{"$f":"S387&T387","v":"c_hyt_0032_slide"},{"$nulls":3},{"$f":"IF(X387=\"\",\"\",U387)","v":""}]
[{"$nulls":15},239022,"39","2","c_hyt_0032","_slide","c_hyt_0032_slide",{"$nulls":3},""]
[{"$nulls":15},239023,"39","2","c_hyt_0032","_slide","c_hyt_0032_slide",{"$nulls":3},""]
[{"$nulls":15},239024,"39","2","c_hyt_0032","_slide","c_hyt_0032_slide",{"$nulls":3},""]
[{"$nulls":15},239025,"39","2","c_hyt_0032","_slide","c_hyt_0032_slide",{"$nulls":3},""]
[{"$nulls":15},240011,"40","1","c_rj_0033","_tap","c_rj_0033_tap",null,null,"煌炎斩","c_rj_0033_tap"]
[{"$nulls":15},240012,"40","1","c_rj_0033","_tap","c_rj_0033_tap",null,null,"煌炎斩","c_rj_0033_tap"]
[{"$nulls":15},240013,"40","1","c_rj_0033","_tap","c_rj_0033_tap",null,null,"煌炎斩","c_rj_0033_tap"]
[{"$nulls":15},240014,"40","1","c_rj_0033","_tap","c_rj_0033_tap",null,null,"煌炎斩","c_rj_0033_tap"]
[{"$nulls":15},240015,"40","1","c_rj_0033","_tap","c_rj_0033_tap",null,null,"煌炎斩","c_rj_0033_tap"]
[{"$nulls":15},240021,"40","2","c_rj_0033",{"$f":"T387","v":"_slide"},"c_rj_0033_slide",{"$nulls":3},""]
[{"$nulls":15},240022,"40","2","c_rj_0033","_slide","c_rj_0033_slide",{"$nulls":3},""]
[{"$nulls":15},240023,"40","2","c_rj_0033","_slide","c_rj_0033_slide",{"$nulls":3},""]
[{"$nulls":15},240024,"40","2","c_rj_0033","_slide","c_rj_0033_slide",{"$nulls":3},""]
[{"$nulls":15},240025,"40","2","c_rj_0033","_slide","c_rj_0033_slide",{"$nulls":3},""]
[{"$nulls":15},241011,"41","1","c_mc_0034","_tap","c_mc_0034_tap",null,null,"烈虎归山","c_mc_0034_tap"]
[{"$nulls":15},241012,"41","1","c_mc_0034","_tap","c_mc_0034_tap",null,null,"烈虎归山","c_mc_0034_tap"]
[{"$nulls":15},241013,"41","1","c_mc_0034","_tap","c_mc_0034_tap",null,null,"烈虎归山","c_mc_0034_tap"]
[{"$nulls":15},241014,"41","1","c_mc_0034","_tap","c_mc_0034_tap",null,null,"烈虎归山","c_mc_0034_tap"]
[{"$nulls":15},241015,"41","1","c_mc_0034","_tap","c_mc_0034_tap",null,null,"烈虎归山","c_mc_0034_tap"]
[{"$nulls":15},241021,"41","2","c_mc_0034","_slide","c_mc_0034_slide",{"$nulls":3},""]
[{"$nulls":15},241022,"41","2","c_mc_0034","_slide","c_mc_0034_slide",{"$nulls":3},""]
[{"$nulls":15},241023,"41","2","c_mc_0034","_slide","c_mc_0034_slide",{"$nulls":3},""]
[{"$nulls":15},241024,"41","2","c_mc_0034","_slide","c_mc_0034_slide",{"$nulls":3},""]
[{"$nulls":15},241025,"41","2","c_mc_0034","_slide","c_mc_0034_slide",{"$nulls":3},""]
[{"$nulls":15},242011,"42","1","c_yl_0035","_tap","c_yl_0035_tap",null,null,"寻鹰剑","c_yl_0035_tap"]
[{"$nulls":15},242012,"42","1","c_yl_0035","_tap","c_yl_0035_tap",null,null,"寻鹰剑","c_yl_0035_tap"]
[{"$nulls":15},242013,"42","1","c_yl_0035","_tap","c_yl_0035_tap",null,null,"寻鹰剑","c_yl_0035_tap"]
[{"$nulls":15},242014,"42","1","c_yl_0035","_tap","c_yl_0035_tap",null,null,"寻鹰剑","c_yl_0035_tap"]
[{"$nulls":15},242015,"42","1","c_yl_0035","_tap","c_yl_0035_tap",null,null,"寻鹰剑","c_yl_0035_tap"]
[{"$nulls":15},242021,"42","2","c_yl_0035","_slide","c_yl_0035_slide",{"$nulls":3},""]
[{"$nulls":15},242022,"42","2","c_yl_0035","_slide","c_yl_0035_slide",{"$nulls":3},""]
[{"$nulls":15},242023,"42","2","c_yl_0035","_slide","c_yl_0035_slide",{"$nulls":3},""]
[{"$nulls":15},242024,"42","2","c_yl_0035","_slide","c_yl_0035_slide",{"$nulls":3},""]
[{"$nulls":15},242025,"42","2","c_yl_0035","_slide","c_yl_0035_slide",{"$nulls":3},""]
[{"$nulls":15},243011,"43","1","c_wl_0036","_tap","c_wl_0036_tap",null,null,"侵染之刃","c_wl_0036_tap"]
[{"$nulls":15},243012,"43","1","c_wl_0036","_tap","c_wl_0036_tap",null,null,"侵染之刃","c_wl_0036_tap"]
[{"$nulls":15},243013,"43","1","c_wl_0036","_tap","c_wl_0036_tap",null,null,"侵染之刃","c_wl_0036_tap"]
[{"$nulls":15},243014,"43","1","c_wl_0036","_tap","c_wl_0036_tap",null,null,"侵染之刃","c_wl_0036_tap"]
[{"$nulls":15},243015,"43","1","c_wl_0036","_tap","c_wl_0036_tap",null,null,"侵染之刃","c_wl_0036_tap"]
[{"$nulls":15},243021,"43","2","c_wl_0036","_slide","c_wl_0036_slide",{"$nulls":3},""]
[{"$nulls":15},243022,"43","2","c_wl_0036","_slide","c_wl_0036_slide",{"$nulls":3},""]
[{"$nulls":15},243023,"43","2","c_wl_0036","_slide","c_wl_0036_slide",{"$nulls":3},""]
[{"$nulls":15},243024,"43","2","c_wl_0036","_slide","c_wl_0036_slide",{"$nulls":3},""]
[{"$nulls":15},243025,"43","2","c_wl_0036","_slide","c_wl_0036_slide",{"$nulls":3},""]
[{"$nulls":15},244011,"44","1","c_fjzd_0055","_tap","c_fjzd_0055_tap",null,null,"绝息","c_fjzd_0055_tap"]
[{"$nulls":15},244012,"44","1","c_fjzd_0055","_tap","c_fjzd_0055_tap",null,null,"绝息","c_fjzd_0055_tap"]
[{"$nulls":15},244013,"44","1","c_fjzd_0055","_tap","c_fjzd_0055_tap",null,null,"绝息","c_fjzd_0055_tap"]
[{"$nulls":15},244014,"44","1","c_fjzd_0055","_tap","c_fjzd_0055_tap",null,null,"绝息","c_fjzd_0055_tap"]
[{"$nulls":15},244015,"44","1","c_fjzd_0055","_tap","c_fjzd_0055_tap",null,null,"绝息","c_fjzd_0055_tap"]
[{"$nulls":15},244021,"44","2","c_fjzd_0055","_slide","c_fjzd_0055_slide",null,null,"化灵灭影","c_fjzd_0055_slide"]
[{"$nulls":15},244022,"44","2","c_fjzd_0055","_slide","c_fjzd_0055_slide",null,null,"化灵灭影","c_fjzd_0055_slide"]
[{"$nulls":15},244023,"44","2","c_fjzd_0055","_slide","c_fjzd_0055_slide",null,null,"化灵灭影","c_fjzd_0055_slide"]
[{"$nulls":15},244024,"44","2","c_fjzd_0055","_slide","c_fjzd_0055_slide",null,null,"化灵灭影","c_fjzd_0055_slide"]
[{"$nulls":15},244025,"44","2","c_fjzd_0055","_slide","c_fjzd_0055_slide",null,null,"化灵灭影","c_fjzd_0055_slide"]
[{"$nulls":15},245011,"45","1","c_sk_0038","_tap","c_sk_0038_tap",null,null,"援应","c_sk_0038_tap"]
[{"$nulls":15},245012,"45","1","c_sk_0038","_tap","c_sk_0038_tap",null,null,"援应","c_sk_0038_tap"]
[{"$nulls":15},245013,"45","1","c_sk_0038","_tap","c_sk_0038_tap",null,null,"援应","c_sk_0038_tap"]
[{"$nulls":15},245014,"45","1","c_sk_0038","_tap","c_sk_0038_tap",null,null,"援应","c_sk_0038_tap"]
[{"$nulls":15},245015,"45","1","c_sk_0038","_tap","c_sk_0038_tap",null,null,"援应","c_sk_0038_tap"]
[{"$nulls":15},245021,"45","2","c_sk_0038","_slide","c_sk_0038_slide",{"$nulls":3},""]
[{"$nulls":15},245022,"45","2","c_sk_0038","_slide","c_sk_0038_slide",{"$nulls":3},""]
[{"$nulls":15},245023,"45","2","c_sk_0038","_slide","c_sk_0038_slide",{"$nulls":3},""]
[{"$nulls":15},245024,"45","2","c_sk_0038","_slide","c_sk_0038_slide",{"$nulls":3},""]
[{"$nulls":15},245025,{"$f":"MID(P451,2,2)","v":"45"},{"$f":"MID(P451,5,1)","v":"2"},{"$f":"VLOOKUP(Q451,$C$2:$D$53,2,0)","v":"c_sk_0038"},"_slide",{"$f":"S451&T451","v":"c_sk_0038_slide"},{"$nulls":3},{"$f":"IF(X451=\"\",\"\",U451)","v":""}]
[{"$nulls":15},246011,"46","1","c_ly_0039","_tap","c_ly_0039_tap",null,null,"光元刃","c_ly_0039_tap"]
[{"$nulls":15},246012,"46","1","c_ly_0039","_tap","c_ly_0039_tap",null,null,"光元刃","c_ly_0039_tap"]
[{"$nulls":15},246013,"46","1","c_ly_0039","_tap","c_ly_0039_tap",null,null,"光元刃","c_ly_0039_tap"]
[{"$nulls":15},246014,"46","1","c_ly_0039","_tap","c_ly_0039_tap",null,null,"光元刃","c_ly_0039_tap"]
[{"$nulls":15},246015,"46","1","c_ly_0039","_tap","c_ly_0039_tap",null,null,"光元刃","c_ly_0039_tap"]
[{"$nulls":15},246021,"46","2","c_ly_0039","_slide","c_ly_0039_slide",null,null,"月曜闪裂","c_ly_0039_slide"]
[{"$nulls":15},246022,"46","2","c_ly_0039","_slide","c_ly_0039_slide",null,null,"月曜闪裂","c_ly_0039_slide"]
[{"$nulls":15},246023,"46","2","c_ly_0039","_slide","c_ly_0039_slide",null,null,"月曜闪裂","c_ly_0039_slide"]
[{"$nulls":15},246024,"46","2","c_ly_0039","_slide","c_ly_0039_slide",null,null,"月曜闪裂","c_ly_0039_slide"]
[{"$nulls":15},246025,"46","2","c_ly_0039",{"$f":"T451","v":"_slide"},"c_ly_0039_slide",null,null,"月曜闪裂","c_ly_0039_slide"]
[{"$nulls":15},247011,"47","1","c_cff_0047","_tap","c_cff_0047_tap",null,null,"焦热","c_cff_0047_tap"]
[{"$nulls":15},247012,"47","1","c_cff_0047","_tap","c_cff_0047_tap",null,null,"焦热","c_cff_0047_tap"]
[{"$nulls":15},247013,"47","1","c_cff_0047","_tap","c_cff_0047_tap",null,null,"焦热","c_cff_0047_tap"]
[{"$nulls":15},247014,"47","1","c_cff_0047","_tap","c_cff_0047_tap",null,null,"焦热","c_cff_0047_tap"]
[{"$nulls":15},247015,"47","1","c_cff_0047","_tap","c_cff_0047_tap",null,null,"焦热","c_cff_0047_tap"]
[{"$nulls":15},247021,"47","2","c_cff_0047","_slide","c_cff_0047_slide",{"$nulls":3},""]
[{"$nulls":15},247022,"47","2","c_cff_0047","_slide","c_cff_0047_slide",{"$nulls":3},""]
[{"$nulls":15},247023,"47","2","c_cff_0047","_slide","c_cff_0047_slide",{"$nulls":3},""]
[{"$nulls":15},247024,"47","2","c_cff_0047","_slide","c_cff_0047_slide",{"$nulls":3},""]
[{"$nulls":15},247025,"47","2","c_cff_0047","_slide","c_cff_0047_slide",{"$nulls":3},""]
[{"$nulls":15},248011,"48","1","c_yff_0048","_tap","c_yff_0048_tap",null,null,"吹息","c_yff_0048_tap"]
[{"$nulls":15},248012,"48","1","c_yff_0048","_tap","c_yff_0048_tap",null,null,"吹息","c_yff_0048_tap"]
[{"$nulls":15},248013,"48","1","c_yff_0048","_tap","c_yff_0048_tap",null,null,"吹息","c_yff_0048_tap"]
[{"$nulls":15},248014,"48","1","c_yff_0048","_tap","c_yff_0048_tap",null,null,"吹息","c_yff_0048_tap"]
[{"$nulls":15},248015,"48","1","c_yff_0048","_tap","c_yff_0048_tap",null,null,"吹息","c_yff_0048_tap"]
[{"$nulls":15},248021,"48","2","c_yff_0048","_slide","c_yff_0048_slide",{"$nulls":3},""]
[{"$nulls":15},248022,"48","2","c_yff_0048","_slide","c_yff_0048_slide",{"$nulls":3},""]
[{"$nulls":15},248023,"48","2","c_yff_0048","_slide","c_yff_0048_slide",{"$nulls":3},""]
[{"$nulls":15},248024,"48","2","c_yff_0048","_slide","c_yff_0048_slide",{"$nulls":3},""]
[{"$nulls":15},248025,"48","2","c_yff_0048","_slide","c_yff_0048_slide",{"$nulls":3},""]
[{"$nulls":15},249011,"49","1","c_cff_0049","_tap","c_cff_0049_tap",null,null,"逐浪","c_cff_0049_tap"]
[{"$nulls":15},249012,"49","1","c_cff_0049","_tap","c_cff_0049_tap",null,null,"逐浪","c_cff_0049_tap"]
[{"$nulls":15},249013,"49","1","c_cff_0049","_tap","c_cff_0049_tap",null,null,"逐浪","c_cff_0049_tap"]
[{"$nulls":15},249014,"49","1","c_cff_0049","_tap","c_cff_0049_tap",null,null,"逐浪","c_cff_0049_tap"]
[{"$nulls":15},249015,"49","1","c_cff_0049","_tap","c_cff_0049_tap",null,null,"逐浪","c_cff_0049_tap"]
[{"$nulls":15},249021,"49","2","c_cff_0049","_slide","c_cff_0049_slide",{"$nulls":3},""]
[{"$nulls":15},249022,"49","2","c_cff_0049","_slide","c_cff_0049_slide",{"$nulls":3},""]
[{"$nulls":15},249023,"49","2","c_cff_0049","_slide","c_cff_0049_slide",{"$nulls":3},""]
[{"$nulls":15},249024,"49","2","c_cff_0049","_slide","c_cff_0049_slide",{"$nulls":3},""]
[{"$nulls":15},249025,"49","2","c_cff_0049","_slide","c_cff_0049_slide",{"$nulls":3},""]
[{"$nulls":15},250011,"50","1","c_jff_0050","_tap","c_jff_0050_tap",null,null,"岩落","c_jff_0050_tap"]
[{"$nulls":15},250012,"50","1","c_jff_0050","_tap","c_jff_0050_tap",null,null,"岩落","c_jff_0050_tap"]
[{"$nulls":15},250013,"50","1","c_jff_0050","_tap","c_jff_0050_tap",null,null,"岩落","c_jff_0050_tap"]
[{"$nulls":15},250014,"50","1","c_jff_0050","_tap","c_jff_0050_tap",null,null,"岩落","c_jff_0050_tap"]
[{"$nulls":15},250015,"50","1","c_jff_0050","_tap","c_jff_0050_tap",null,null,"岩落","c_jff_0050_tap"]
[{"$nulls":15},250021,"50","2","c_jff_0050","_slide","c_jff_0050_slide",{"$nulls":3},""]
[{"$nulls":15},250022,"50","2","c_jff_0050","_slide","c_jff_0050_slide",{"$nulls":3},""]
[{"$nulls":15},250023,"50","2","c_jff_0050","_slide","c_jff_0050_slide",{"$nulls":3},""]
[{"$nulls":15},250024,"50","2","c_jff_0050","_slide","c_jff_0050_slide",{"$nulls":3},""]
[{"$nulls":15},250025,"50","2","c_jff_0050","_slide","c_jff_0050_slide",{"$nulls":3},""]
[{"$nulls":15},251011,"51","1","c_ym_0051","_tap","c_ym_0051_tap",null,null,"震元","c_ym_0051_tap"]
[{"$nulls":15},251012,"51","1","c_ym_0051","_tap","c_ym_0051_tap",null,null,"震元","c_ym_0051_tap"]
[{"$nulls":15},251013,"51","1","c_ym_0051","_tap","c_ym_0051_tap",null,null,"震元","c_ym_0051_tap"]
[{"$nulls":15},251014,"51","1","c_ym_0051","_tap","c_ym_0051_tap",null,null,"震元","c_ym_0051_tap"]
[{"$nulls":15},251015,"51","1","c_ym_0051","_tap","c_ym_0051_tap",null,null,"震元","c_ym_0051_tap"]
[{"$nulls":15},251021,"51","2","c_ym_0051","_slide","c_ym_0051_slide",{"$nulls":3},""]
[{"$nulls":15},251022,"51","2","c_ym_0051","_slide","c_ym_0051_slide",{"$nulls":3},""]
[{"$nulls":15},251023,"51","2","c_ym_0051","_slide","c_ym_0051_slide",{"$nulls":3},""]
[{"$nulls":15},251024,"51","2","c_ym_0051","_slide","c_ym_0051_slide",{"$nulls":3},""]
[{"$nulls":15},251025,"51","2","c_ym_0051","_slide","c_ym_0051_slide",{"$nulls":3},""]
[{"$nulls":15},252011,"52","1","c_ym_0052","_tap","c_ym_0052_tap",null,null,"混沌","c_ym_0052_tap"]
[{"$nulls":15},252012,"52","1","c_ym_0052","_tap","c_ym_0052_tap",null,null,"混沌","c_ym_0052_tap"]
[{"$nulls":15},252013,"52","1","c_ym_0052","_tap","c_ym_0052_tap",null,null,"混沌","c_ym_0052_tap"]
[{"$nulls":15},252014,{"$f":"MID(P515,2,2)","v":"52"},{"$f":"MID(P515,5,1)","v":"1"},{"$f":"VLOOKUP(Q515,$C$2:$D$53,2,0)","v":"c_ym_0052"},"_tap",{"$f":"S515&T515","v":"c_ym_0052_tap"},null,null,"混沌",{"$f":"IF(X515=\"\",\"\",U515)","v":"c_ym_0052_tap"}]
[{"$nulls":15},252015,"52","1","c_ym_0052","_tap","c_ym_0052_tap",null,null,"混沌","c_ym_0052_tap"]
[{"$nulls":15},252021,"52","2","c_ym_0052","_slide","c_ym_0052_slide",{"$nulls":3},""]
[{"$nulls":15},252022,"52","2","c_ym_0052","_slide","c_ym_0052_slide",{"$nulls":3},""]
[{"$nulls":15},252023,"52","2","c_ym_0052","_slide","c_ym_0052_slide",{"$nulls":3},""]
[{"$nulls":15},252024,"52","2","c_ym_0052","_slide","c_ym_0052_slide",{"$nulls":3},""]
[{"$nulls":15},252025,"52","2","c_ym_0052","_slide","c_ym_0052_slide",{"$nulls":3},""]

{"sheet":"Sheet1","index":3,"n_rows":422,"n_cols":2,"rows_kept":422}
[1,"MP_ExploreMap_sj_0010"]
[2,"MP_ExploreMap_sj_0011"]
[3,"ME_Explorer_0004"]
[4,"ME_Explorer_0001"]
[5,"ME_Explorer_0007"]
[6,"ME_Explorer_0002"]
[7,"ME_Explorer_0005"]
[8]
[9]
[10,"ME_Explorer_0002"]
[101,"s_shangcheng_hunjing_01"]
[102,"s_shangcheng_hunjing_02"]
[103,"s_shangcheng_hunjing_03"]
[104,"s_shangcheng_hunjing_04"]
[105,"s_shangcheng_hunjing_05"]
[106,"s_shangcheng_hunjing_06"]
[201,"r_playerrumble_yiyao_01"]
[202,"r_playerrumble_yiyao_02"]
[203,"r_playerrumble_yiyao_03"]
[204,"r_playerrumble_yiyao_04"]
[205,"r_playerrumble_yiyao_05"]
[206,"r_playerrumble_yiyao_06"]
[207,"r_playerrumble_yiyao_07"]
[208,"r_playerrumble_yiyao_08"]
[209,"r_playerrumble_yiyao_09"]
[210,"r_playerrumble_yiyao_10"]
[301,"gh_tt_1"]
[302,"gh_tt_2"]
[303,"gh_tt_3"]
[304,"gh_tt_4"]
[305,"gh_tt_5"]
[306,"gh_tt_6"]
[307,"gh_tt_7"]
[308,"gh_tt_8"]
[309,"gh_tt_9"]
[501,"s_sbtj_renwu"]
[502,"s_sbtj_biaoti"]
[503,"t_tsec_fengli"]
[504,"t_tsec_huoshu"]
[505,"t_tsec_modao"]
[506,"t_tsec_sunlong"]
[507,"t_tsec_biaoti"]
[1001,"c_syf_0016_t3"]
[1002,"c_ch_0015_t3"]
[1003,"c_xhht_0017_t3"]
[1004,"c_yr_0007_t3"]
[1005,"c_dmk_0043_t3"]
[1006,"c_qlq_0006_t3"]
[1007,"c_jz_0002_t3"]
[1008,"c_bmf_0004_t3"]
[1009,"c_qf_0046_t3"]
[1010,"c_yqj_0042_t3"]
[1011,"c_yy_0041_t3"]
[1012,"c_mrzq_0010_t3"]
[1013,"c_yl_0014_t3"]
[1014,"c_gt_0001_t3"]
[1015,"c_xy_0012_t3"]
[1016,"c_cyh_0008_t3"]
[1017,"c_sxdw_0053_t3"]
[1018,"c_zh_0044_t3"]
[1019,"c_kq_0018_t3"]
[1020,"c_ywy_0040_t3"]
[1021,"c_mlmn_0054_t3"]
[1022,"c_ywg_0045_t3"]
[1023,"c_hyt_0032_t3"]
[1024,"c_xjr_0003_t3"]
[1025,"c_tx_0011_t3"]
[1026,"c_sq_0019_t3"]
[1027,"c_nye_0020_t3"]
[1028,"c_zc_0021_t3"]
[1029,"c_lhmn_0056_t3"]
[1030,"c_yy_0023_t3"]
[1031,"c_jpw_0024_t3"]
[1032,"c_ly_0025_t3"]
[1033,"c_xy_0026_t3"]
[1034,"c_fm_0027_t3"]
[1035,"c_skr_0028_t3"]
[1036,"c_jy_0029_t3"]
[1037,"c_xl_0030_t3"]
[1038,"c_cs_0031_t3"]
[1039,"c_qr_0065_t3"]
[1040,"c_rj_0033_t3"]
[1041,"c_mc_0034_t3"]
[1042,"c_yl_0035_t3"]
[1043,"c_wl_0036_t3"]
[1044,"c_fjzd_0055_t3"]
[1045,"c_sk_0038_t3"]
[1046,"c_ly_0039_t3"]
[1047,"c_cff_0047_t3"]
[1048,"c_yff_0048_t3"]
[1049,"c_cff_0049_t3"]
[1050,"c_jff_0050_t3"]
[1051,"c_ym_0051_t3"]
[1052,"c_ym_0052_t3"]
[1053,"c_ax_0067_t3"]
[1054,"c_bm_0068_t3"]
[1055,"c_ly_0070_t3"]
[1056,"c_yqe_0071_t3"]
[1057,"c_yxz_0057_t3"]
[1058,"c_ne_0058_t3"]
[1059,"c_fzy_0061_t3"]
[1060,"c_y_0013_t3"]
[1061,"c_zs_0080_t3"]
[1062,"c_ywe_0078_t3"]
[1063,"c_y_0013_t3"]
[1064,"c_zs_0080_t3"]
[1065,"c_ywe_0078_t3"]
[1066,"c_y_0013_t3"]
[1067,"c_zs_0080_t3"]
[1068,"c_ywe_0078_t3"]
[1069,"c_y_0013_t3"]
[1070,"c_zs_0080_t3"]
[1071,"c_ywe_0078_t3"]
[1072,"c_y_0013_t3"]
[1073,"c_zs_0080_t3"]
[1074,"c_ywe_0078_t3"]
[1075,"c_y_0013_t3"]
[1076,"c_zs_0080_t3"]
[1077,"c_ywe_0078_t3"]
[1078,"c_y_0013_t3"]
[1079,"c_zs_0080_t3"]
[1080,"c_ywe_0078_t3"]
[1081,"c_y_0013_t3"]
[1082,"c_zs_0080_t3"]
[1083,"c_ywe_0078_t3"]
[1084,"c_y_0013_t3"]
[1085,"c_zs_0080_t3"]
[1086,"c_ywe_0078_t3"]
[1087,"c_y_0013_t3"]
[1088,"c_zs_0080_t3"]
[1089,"c_ywe_0078_t3"]
[1090,"c_y_0013_t3"]
[1091,"c_zs_0080_t3"]
[1092,"c_ywe_0078_t3"]
[1093,"c_y_0013_t3"]
[1094,"c_zs_0080_t3"]
[1095,"c_ywe_0078_t3"]
[1096,"c_y_0013_t3"]
[1097,"c_zs_0080_t3"]
[1098,"c_ywe_0078_t3"]
[1099,"c_y_0013_t3"]
[1100,"c_zs_0080_t3"]
[1501,"r_class_mifa"]
[1502,"r_class_shenghua"]
[1503,"r_class_tianfa"]
[1504,"r_class_wuwei"]
[1505,"r_class_xuance"]
[1510,"r_CurrencyEquip_green"]
[1511,"r_CurrencyEquip_blue"]
[1512,"r_CurrencyEquip_purple"]
[1513,"r_CurrencyEquip_orange"]
[1520,"r_RareItem_QuestNew_0001"]
[1521,"r_RareItem_QuestNew_0002"]
[1522,"r_RareItem_QuestNew_0003"]
[1523,"r_RareItem_QuestNew_0004"]
[1524,"r_RareItem_QuestNew_0005"]
[1525,"r_RareItem_QuestNew_0006"]
[1526,"r_RareItem_QuestNew_0007"]
[1527,"r_RareItem_QuestNew_0008"]
[1528,"r_RareItem_QuestNew_0009"]
[1529,"r_RareItem_QuestNew_0010"]
[1530,"r_RareItem_QuestNew_0011"]
[1531,"r_RareItem_QuestNew_0011"]
[1532,"r_RareItem_QuestNew_0003"]
[1533,"r_RareItem_QuestNew_0001"]
[1534,"r_RareItem_QuestNew_0002"]
[1535,"r_RareItem_QuestNew_0004"]
[1536,"r_RareItem_MapReward_0004"]
[1537,"r_RareItem_MapReward_0004"]
[1538,"r_RareItem_MapReward_0006"]
[1539,"r_RareItem_Quest_0012"]
[1540,"r_RareItem_Quest_0014"]
[1541,"r_RareItem_QuestNew_0001"]
[1542,"r_RareItem_QuestNew_0001"]
[1543,"r_RareItem_QuestNew_0001"]
[1544,"r_RareItem_QuestNew_0001"]
[1545,"r_RareItem_Quest_0024"]
[1546,"r_RareItem_MapReward_0001"]
[1547,"r_RareItem_Quest_0009"]
[1548,"r_RareItem_MapReward_0004"]
[1549,"r_RareItem_Quest_0013"]
[1550,"r_RareItem_QuestNew_0001"]
[1551,"r_RareMaterial_Talent_0003"]
[1801,"r_zjm_icon-jielin002"]
[1802,"r_zjm_yinyaoju"]
[1803,"r_zjm_icon-chengyuan002"]
[1804,"r_zjm_icon-cangku002"]
[1805,"r_zjm_icon-zhujue002"]
[1806,"r_zjm_tianfushu"]
[1807,"r_zjm_haoyou"]
[1808,"r_zjm_richangrenwu"]
[1809,"r_zjm_huodongicon-yunmengqifu"]
[1810,"r_zjm_huodongicon-jielinmibao"]
[1811,"r_zjm_huodongicon-kaifuli"]
[1812,"r_zjm_fuli"]
[1813,"r_zjm_xianshihuodong"]
[1814,"r_zjm_muyindian"]
[1815,"r_zjm_liulingge"]
[1816,"r_zjm_juyiting"]
[1817,"r_zjm_mijing"]
[1818,"r_zjm_jingjichang"]
[1819,"r_zjm_liaotian"]
[1820,"r_zjm_baibaozhai"]
[1821,"r_zjm_mibaoxuan"]
[1822,"r_zjm_xianjitan"]
[1823,"r_zjm_gushi"]
[1824,"r_zjm_juqingfuben"]
[1825,"r_zjm_jingyingfuben"]
[1826,"r_zjm_shilianfuben"]
[1827,"r_zjm_wujinfuben"]
[1828,"r_zjm_suoyaota"]
[1829,"r_zjm_xuezhandaodi"]
[1830,"r_zjm_zhanlipaihang"]
[1831,"r_zjm_kaifukuanghuan"]
[1832,"r_zjm_changshulou"]
[1833,"r_zjm_guanxingtai"]
[1834,"r_zjm_qunxiongbang"]
[1835,"r_zjm_doulinjing"]
[2001,"live2d_c_syf_0016"]
[2002,"live2d_c_ch_0015"]
[2003,"live2d_c_xhht_0017"]
[2004,"live2d_c_yr_0007"]
[2005,"live2d_c_dmk_0043"]
[2006,"live2d_c_qlq_0006"]
[2007,"live2d_c_jz_0002"]
[2008,"live2d_c_bmf_0004"]
[2009,"live2d_c_qf_0046"]
[2010,"live2d_c_yqj_0042"]
[2011,"live2d_c_yy_0041"]
[2012,"live2d_c_mrzq_0010"]
[2013,"live2d_c_yl_0014"]
[2014,"live2d_c_gt_0001"]
[2015,"live2d_c_xy_0012"]
[2016,"live2d_c_cyh_0008"]
[2017,"live2d_c_sxdw_0053"]
[2018,"live2d_c_zh_0044"]
[2019,"live2d_c_kq_0018"]
[2020,"live2d_c_ywy_0040"]
[2021,"live2d_c_mlmn_0054"]
[2022,"live2d_c_ywg_0045"]
[2023,"live2d_c_hyt_0032"]
[2024,"live2d_c_xjr_0003"]
[2025,"live2d_c_tx_0011"]
[2026,"live2d_c_sq_0019"]
[2027,"live2d_c_nye_0020"]
[2028,"live2d_c_zc_0021"]
[2029,"live2d_c_sxdw_0056"]
[2030,"live2d_c_yy_0023"]
[2031,"live2d_c_jpw_0024"]
[2032,"live2d_c_ly_0025"]
[2033,"live2d_c_xy_0026"]
[2034,"live2d_c_fm_0027"]
[2035,"live2d_c_skr_0028"]
[2036,"live2d_c_jy_0029"]
[2037,"live2d_c_xl_0030"]
[2038,"live2d_c_cs_0031"]
[2039,"live2d_c_qr_0065"]
[2040,"live2d_c_rj_0033"]
[2041,"live2d_c_mc_0034"]
[2042,"live2d_c_yl_0035"]
[2043,"live2d_c_wl_0036"]
[2044,"live2d_c_fjzd_0055"]
[2045,"live2d_c_sk_0038"]
[2046,"live2d_c_ly_0039"]
[2047,"live2d_c_cff_0047"]
[2048,"live2d_c_yff_0048"]
[2049,"live2d_c_cff_0049"]
[2050,"live2d_c_jff_0050"]
[2051,"live2d_c_ym_0051"]
[2052,"live2d_c_ym_0052"]
[2053,"live2d_c_yxz_0057"]
[2054,"live2d_c_ne_0058"]
[2055,"live2d_c_xy_0026"]
[2056,"live2d_c_ax_0067"]
[2057,"live2d_c_lhmn_0056"]
[2058,"live2d_c_bm_0068"]
[2059,"live2d_c_ly_0070"]
[2060,"live2d_c_yqe_0071"]
[2061,"live2d_c_fzy_0061"]
[2062,"live2d_c_y_0013"]
[2063,"live2d_c_zs_0080"]
[2064,"live2d_c_ywe_0078"]
[2065,"live2d_c_y_0013"]
[2066,"live2d_c_zs_0080"]
[2067,"live2d_c_ywe_0078"]
[2068,"live2d_c_y_0013"]
[2069,"live2d_c_zs_0080"]
[2070,"live2d_c_ywe_0078"]
[2071,"live2d_c_y_0013"]
[2072,"live2d_c_zs_0080"]
[2073,"live2d_c_ywe_0078"]
[2074,"live2d_c_y_0013"]
[2075,"live2d_c_zs_0080"]
[2076,"live2d_c_ywe_0078"]
[2077,"live2d_c_y_0013"]
[2078,"live2d_c_zs_0080"]
[2079,"live2d_c_ywe_0078"]
[2080,"live2d_c_y_0013"]
[2081,"live2d_c_zs_0080"]
[2082,"live2d_c_ywe_0078"]
[2083,"live2d_c_y_0013"]
[2084,"live2d_c_zs_0080"]
[2085,"live2d_c_ywe_0078"]
[2086,"live2d_c_y_0013"]
[2087,"live2d_c_zs_0080"]
[2088,"live2d_c_ywe_0078"]
[2089,"live2d_c_y_0013"]
[2090,"live2d_c_zs_0080"]
[2091,"live2d_c_ywe_0078"]
[2092,"live2d_c_y_0013"]
[2093,"live2d_c_zs_0080"]
[2094,"live2d_c_ywe_0078"]
[2095,"live2d_c_y_0013"]
[2096,"live2d_c_zs_0080"]
[2097,"live2d_c_ywe_0078"]
[2098,"live2d_c_y_0013"]
[2099,"live2d_c_zs_0080"]
[2100,"live2d_c_ywe_0078"]
[2101,"live2d_c_y_0013"]
[2102,"live2d_c_zs_0080"]
[2501,"live2d_c_yxz_0057"]
[2502,"live2d_c_ne_0058"]
[3001,"c_syf_0016_t1"]
[3002,"c_ch_0015_t1"]
[3003,"c_xhht_0017_t1"]
[3004,"c_yr_0007_t1"]
[3005,"c_dmk_0043_t1"]
[3006,"c_qlq_0006_t1"]
[3007,"c_jz_0002_t1"]
[3008,"c_bmf_0004_t1"]
[3009,"c_qf_0046_t1"]
[3010,"c_yqj_0042_t1"]
[3011,"c_yy_0041_t1"]
[3012,"c_mrzq_0010_t1"]
[3013,"c_yl_0014_t1"]
[3014,"c_gt_0001_t1"]
[3015,"c_xy_0012_t1"]
[3016,"c_cyh_0008_t1"]
[3017,"c_sxdw_0053_t1"]
[3018,"c_zh_0044_t1"]
[3019,"c_kq_0018_t1"]
[3020,"c_ywy_0040_t1"]
[3021,"c_mlmn_0054_t1"]
[3022,"c_ywg_0045_t1"]
[3023,"c_hyt_0032_t1"]
[3024,"c_xjr_0003_t1"]
[3025,"c_tx_0011_t1"]
[3026,"c_sq_0019_t1"]
[3027,"c_nye_0020_t1"]
[3028,"c_zc_0021_t1"]
[3029,"c_lhmn_0056_t1"]
[3030,"c_yy_0023_t1"]
[3031,"c_jpw_0024_t1"]
[3032,"c_ly_0025_t1"]
[3033,"c_xy_0026_t1"]
[3034,"c_fm_0027_t1"]
[3035,"c_skr_0028_t1"]
[3036,"c_jy_0029_t1"]
[3037,"c_xl_0030_t1"]
[3038,"c_cs_0031_t1"]
[3039,"c_qr_0065_t1"]
[3040,"c_rj_0033_t1"]
[3041,"c_mc_0034_t1"]
[3042,"c_yl_0035_t1"]
[3043,"c_wl_0036_t1"]
[3044,"c_fjzd_0055_t1"]
[3045,"c_sk_0038_t1"]
[3046,"c_ly_0039_t1"]
[3047,"c_cff_0047_t1"]
[3048,"c_yff_0048_t1"]
[3049,"c_cff_0049_t1"]
[3050,"c_jff_0050_t1"]
[3051,"c_ym_0051_t1"]
[3052,"c_ym_0052_t1"]
[3053,"c_ax_0067_t1"]
[3054,"c_bm_0068_t1"]
[3055,"c_ly_0070_t1"]
[3056,"c_yqe_0071_t1"]
[3057,"c_yxz_0057_t1"]
[3058,"c_ne_0058_t1"]
[3059,"c_fzy_0061_t1"]
[3060,"c_y_0013_t1"]
[3061,"c_zs_0080_t1"]
[3062,"c_ywe_0078_t1"]
[3063,"c_y_0013_t1"]
[3064,"c_zs_0080_t1"]
[3065,"c_ywe_0078_t1"]
[3066,"c_y_0013_t1"]
[3067,"c_zs_0080_t1"]
[3068,"c_ywe_0078_t1"]
[3069,"c_y_0013_t1"]
[3070,"c_zs_0080_t1"]
[3071,"c_ywe_0078_t1"]
[3072,"c_y_0013_t1"]
[3073,"c_zs_0080_t1"]
[3074,"c_ywe_0078_t1"]
[3075,"c_y_0013_t1"]
[3076,"c_zs_0080_t1"]
[3077,"c_ywe_0078_t1"]
[3078,"c_y_0013_t1"]
[3079,"c_zs_0080_t1"]
[3080,"c_ywe_0078_t1"]
[3081,"c_y_0013_t1"]
[3082,"c_zs_0080_t1"]
[3083,"c_ywe_0078_t1"]
[3084,"c_y_0013_t1"]
[3085,"c_zs_0080_t1"]
[3086,"c_ywe_0078_t1"]
[3087,"c_y_0013_t1"]
[3088,"c_zs_0080_t1"]
[3089,"c_ywe_0078_t1"]
[3090,"c_y_0013_t1"]
[3091,"c_zs_0080_t1"]
[3092,"c_ywe_0078_t1"]
[3093,"c_y_0013_t1"]
[3094,"c_zs_0080_t1"]
[3095,"c_ywe_0078_t1"]
[3096,"c_y_0013_t1"]
[3097,"c_zs_0080_t1"]
[3098,"c_ywe_0078_t1"]
[3099,"c_y_0013_t1"]
[3100,"c_zs_0080_t1"]

{"sheet":"Sheet2","index":4,"n_rows":3,"n_cols":2,"rows_kept":3}
[null,"c_hyt_0032_t3"]
[null,"live2d_c_hyt_0032"]
[null,"c_hyt_0032_t1"]

{"sheet":"Sheet3","index":5,"n_rows":150,"n_cols":1,"rows_kept":150}
["i_s_2006830_xne"]
["i_s_ysz_21"]
["i_s_ysz_14"]
["i_s_ysz_12"]
["i_s_ysz_1"]
["i_s_tybd_13"]
["i_s_tybd_08"]
["i_s_tybd_07"]
["i_s_tybd_06"]
["i_s_tybd_05"]
["i_s_tybd_03"]
["i_s_9810_hyjl"]
["i_s_9050_wy"]
["i_s_7540_nxy"]
["i_s_7530_nxy"]
["i_s_7520_nxy"]
["i_s_7510_nxy"]
["i_s_7340_nxt"]
["i_s_7220_ly"]
["i_s_7210_ly"]
["i_s_6510_nxf"]
["i_s_6330_lq"]
["i_s_6330_lq"]
["i_s_6230_xy"]
["i_s_6220_xy"]
["i_s_5940_sy"]
["i_s_5920_sy"]
["i_s_5830_sy"]
["i_s_5820_sy"]
["i_s_5650_sks"]
["i_s_5640_sks"]
["i_s_5620_sks"]
["i_s_5610_sks"]
["i_s_5520_lz"]
["i_s_5510_lz"]
["i_s_5240_xx"]
["i_s_5230_xx"]
["i_s_5220_xx"]
["i_s_5120_yz"]
["i_s_48500_sf"]
["i_s_4840_sf"]
["i_s_4820_sf"]
["i_s_4730_cn"]
["i_s_4540_yh"]
["i_s_4304_jzls"]
["i_s_4303_jzls"]
["i_s_4301_jzls"]
["i_s_4130_nl"]
["i_s_4120_nl"]
["i_s_4050_yz"]
["i_s_4020_yz"]
["i_s_3930_xne"]
["i_s_3850_ym"]
["i_s_3840_ym"]
["i_s_3820_ym"]
["i_s_3810_ym"]
["i_s_3730_yl"]
["i_s_3720_yl"]
["i_s_3710_yl"]
["i_s_3620_gs"]
["i_s_3550_gmls"]
["i_s_3520_gmls"]
["i_s_3440_yhzs"]
["i_s_3420_yhzs"]
["i_s_3410_yhzs"]
["i_s_3330_hdls"]
["i_s_3320_hdls"]
["i_s_3230_hals"]
["i_s_3210_hals"]
["i_s_3140_tzls"]
["i_s_3130_tzls"]
["i_s_3050_gy"]
["i_s_3040_gy"]
["i_s_3030_gy"]
["i_s_3020_gy"]
["i_s_3010_gy"]
["i_s_2840_yx"]
["i_s_2830_yx"]
["i_s_2740_swls"]
["i_s_2720_swls"]
["i_s_2710_swls"]
["i_s_2640_yysz"]
["i_s_2620_yysz"]
["i_s_2550_yy"]
["i_s_2530_yy"]
["i_s_2520_yy"]
["i_s_2510_yy"]
["i_s_2350_m"]
["i_s_2150_ny"]
["i_s_2120_ny"]
["i_s_2110_ny"]
["i_s_2040_lzls"]
["i_s_2030_lzls"]
["i_s_2020_lzls"]
["i_s_2010_lzls"]
["i_s_2006810_xne"]
["i_s_2005650_gs"]
["i_s_2005630_gs"]
["i_s_2005620_gs"]
["i_s_2005610_gs"]
["i_s_2005550_sje"]
["i_s_2005540_sje"]
["i_s_2005520_sje"]
["i_s_2005510_sje"]
["i_s_2002730_zhs"]
["i_s_2002130_yl"]
["i_s_2002030_wy"]
["i_s_2001830_dz"]
["i_s_2001810_dz"]
["i_s_2001740_yls"]
["i_s_2001530_jzwb"]
["i_s_2001520_jzwb"]
["i_s_2001020_gb"]
["i_s_2001010_gb"]
["i_s_2000950_lyy"]
["i_s_2000940_lyy"]
["i_s_2000850_hy"]
["i_s_2000820_hy"]
["i_s_2000610_bw"]
["i_s_2000520_hw"]
["i_s_2000510_hw"]
["i_s_2000450_gzn"]
["i_s_2000350_xy"]
["i_s_2000320_xy"]
["i_s_1920_dz"]
["i_s_1910_dz"]
["i_s_1840_yx"]
["i_s_1830_yx"]
["i_s_1820_yx"]
["i_s_1810_yx"]
["i_s_1730_lp"]
["i_s_1710_lp"]
["i_s_1650_dz"]
["i_s_1630_dz"]
["i_s_1550_yzy"]
["i_s_1520_yzy"]
["i_s_1430_hylr"]
["i_s_1410_hylr"]
["i_s_1340_sx"]
["i_s_1330_sx"]
["i_s_1320_sx"]
["i_s_1310_sx"]
["i_s_1220_ls"]
["i_s_1210_ls"]
["i_s_1150_dj"]
["i_s_1140_dj"]
["i_s_1130_dj"]
["i_s_1120_dj"]
["i_s_1110_dj"]
["i_s_1000310_bxjl"]