{"text_format":"3","workbook":"xlsx","n_sheets":4,"sheets":["LotteryRewardConfig","Sheet1","Sheet2","Sheet3"],"not_rendered":{"images":1,"external_links":2,"defined_names":2},"read":"whole","date_system":"1900"}

{"sheet":"LotteryRewardConfig","index":0,"n_rows":794,"n_cols":10,"rows_kept":794}
[null,"Id","Reward","ItemName","Pool","Weight","OpenRules","Star","NoUse","Quality"]
[null,"int","mut,int#int,1","string","int","int","mut,int#int,1","int","string","int"]
[null,2,2,0,2,2,4,4,0,0]
[null,"索引","道具","道具名称","属于的卡池（1群英卡池，2友情池，3普通池，11-15元素卡池，101东海寻仙卡池，其余特殊卡池LotterySpecialConfig）","权重","角色加入条件\n(1玩家抽卡次数 2等级  ）","是否为保底\n0非保底\nN对应special表的ID\n指定清除该行计数","备注","备注"]
["默认值",0,null,"",0,0,null,0]
["正确性校对"]
["校对值"]
[null,1,"10001#1","孙策",1,32,null,7,null,45]
[null,2,"10006#1","张郃",1,32,null,7,null,45]
[null,3,"10008#1","曹操",1,32,null,7,null,45]
[null,4,"10009#1","小乔",1,32,null,7,null,45]
[null,5,"10011#1","司马懿",1,32,null,7,null,45]
[null,6,"10014#1","周瑜",1,32,null,7,null,45]
[null,7,"10022#1","诸葛亮",1,32,null,7,null,45]
[null,8,"10023#1","赵云",1,32,null,7,null,45]
[null,9,"10026#1","吕布",1,32,null,7,null,45]
[null,10,"10040#1","张昭",1,32,null,7,null,45]
[null,11,"10041#1","华雄",1,32,null,7,null,45]
[null,12,"10085#1","曹植",1,32,null,7,null,45]
[null,13,"10086#1","刘婵",1,32,null,7,null,45]
[null,14,"10088#1","左慈",1,32,null,7,null,45]
[null,15,"10089#1","黄忠",1,32,null,7,null,45]
[null,16,"10090#1","陈宫",1,32,null,7,null,45]
[null,17,"10002#1","张辽",1,100,null,7,null,35]
[null,18,"10003#1","夏侯惇",1,100,null,7,null,35]
[null,19,"10004#1","大乔",1,100,null,7,null,35]
[null,20,"10005#1","郭嘉",1,100,null,7,null,35]
[null,21,"10007#1","刘备",1,100,null,7,null,35]
[null,22,"10010#1","马超",1,100,null,7,null,35]
[null,23,"10012#1","张飞",1,100,null,7,null,35]
[null,24,"10013#1","袁绍",1,100,null,7,null,35]
[null,25,"10015#1","关羽",1,100,null,7,null,35]
[null,26,"10016#1","孙坚",1,100,null,7,null,35]
[null,27,"10017#1","孙权",1,100,null,7,null,35]
[null,28,"10018#1","荀彧",1,100,null,7,null,35]
[null,29,"10019#1","董卓",1,100,null,7,null,35]
[null,30,"10020#1","曹仁",1,100,null,7,null,35]
[null,31,"10021#1","太史慈",1,100,null,7,null,35]
[null,32,"10024#1","华佗",1,100,null,7,null,35]
[null,33,"10033#1","黄月英",1,100,null,7,null,35]
[null,34,"10042#1","袁术",1,100,null,7,null,35]
[null,35,"10043#1","貂蝉",1,100,null,7,null,35]
[null,36,"10087#1","孙尚香",1,100,null,7,null,35]
[null,37,"10025#1","贾诩",1,157,null,7,null,25]
[null,38,"10027#1","张角",1,157,null,7,null,25]
[null,39,"10028#1","曹丕",1,157,null,7,null,25]
[null,40,"10029#1","魏延",1,157,null,7,null,25]
[null,41,"10030#1","庞统",1,157,null,7,null,25]
[null,42,"10031#1","许褚",1,157,null,7,null,25]
[null,43,"10032#1","甘宁",1,157,null,7,null,25]
[null,44,"10034#1","马岱",1,157,null,7,null,25]
[null,45,"10035#1","陆逊",1,157,null,7,null,25]
[null,46,"10036#1","鲁肃",1,157,null,7,null,25]
[null,47,"10037#1","公孙瓒",1,157,null,7,null,25]
[null,48,"10038#1","于吉",1,157,null,7,null,25]
[null,49,"10039#1","姜维",1,157,null,7,null,25]
[null,50,"10044#1","典韦",1,157,null,7,null,25]
[null,51,"10045#1","甄姬",1,157,null,7,null,25]
[null,52,"10046#1","吕蒙",1,157,null,7,null,25]
[null,53,"10057#1","乐进",1,938,null,6,null,5]
[null,54,"10058#1","夏侯渊",1,938,null,6,null,5]
[null,55,"10059#1","少年曹操",1,938,null,6,null,5]
[null,56,"10060#1","少年甄姬",1,938,null,6,null,5]
[null,57,"10061#1","孟获",1,938,null,6,null,5]
[null,58,"10062#1","祝融",1,938,null,6,null,5]
[null,59,"10063#1","少年赵云",1,938,null,6,null,5]
[null,60,"10064#1","少年关羽",1,938,null,6,null,5]
[null,61,"10065#1","凌统",1,938,null,6,null,5]
[null,62,"10066#1","步练师",1,938,null,6,null,5]
[null,63,"10067#1","少年周瑜",1,938,null,6,null,5]
[null,64,"10068#1","少女小乔",1,938,null,6,null,5]
[null,65,"10069#1","文丑",1,938,null,6,null,5]
[null,66,"10070#1","颜良",1,938,null,6,null,5]
[null,67,"10071#1","少年吕布",1,938,null,6,null,5]
[null,68,"10072#1","少女貂蝉",1,938,null,6,null,5]
[null,69,"10047#1","程昱",1,10000,null,0,null,0]
[null,70,"10048#1","李典",1,10000,null,0,null,0]
[null,71,"10049#1","张苞",1,10000,null,0,null,0]
[null,72,"10050#1","关平",1,10000,null,0,null,0]
[null,73,"10051#1","黄盖",1,10000,null,0,null,0]
{"$rows_left_out":715}
{"sheet":"Sheet1","index":1,"n_rows":16,"n_cols":10,"rows_kept":16}
[]
[null,"道具id","道具数量","道具类型","道具库","权重"]
[null,11]
[]
[]
[]
[{"$nulls":7},"4星万能碎片*10",7]
[{"$nulls":7},"4星英雄",60]
[{"$nulls":7},"5星英雄",9,"真：伪=4：3"]
[{"$nulls":7},"5星万能碎片*10",24]
[]
[]
[{"$nulls":7},"4星万能碎片*10",40]
[{"$nulls":7},"4星英雄",23.3]
[{"$nulls":7},"5星英雄",8.7,"真：伪=4：3"]
[{"$nulls":7},"5星万能碎片*10",28]

{"sheet":"Sheet2","index":2,"n_rows":118,"n_cols":31,"rows_kept":118}
[{"$nulls":4},"品质","角色属性（1、火；2、风；3、水；4、地；5.光；6.暗）",null,null,"s属性","星级",{"$nulls":4},"权重"]
[0,12002,"水系4星随机碎片",{"$f":"B2","v":12002},4,3,null,null,{"$f":"VLOOKUP(F2,$G$12:$H$17,2,FALSE)","v":"水"},{"$f":"IF(B2<13000,E2,51)","v":4},null,"#10",{"$f":"D2&L2","v":"12002#10"},{"$f":"C2","v":"水系4星随机碎片"},7,{"$f":"O2","v":7},{"$f":"ROUND(P2*1000,0)","v":7000},null,null,10001,"夏侯鸿天",11001,"夏侯鸿天碎片",5,11001,5,null,null,"11001#50",{"$f":"LEFT(AC2,5)","v":"11001"},{"$f":"VLOOKUP(--AD2,$Y:$Z,2,FALSE)","v":5}]
[0,12003,"火系4星随机碎片",{"$f":"B3","v":12003},4,1,null,null,"火",4,null,{"$f":"L2","v":"#10"},"12003#10","火系4星随机碎片",{"$f":"O2","v":7},{"$f":"O3","v":7},7000,null,null,10002,"石御霏",11002,"石御霏碎片",5,11002,5,null,null,"11007#50",{"$f":"LEFT(AC3,5)","v":"11007"},{"$f":"VLOOKUP(--AD3,$Y:$Z,2,FALSE)","v":5}]
[0,12004,"地系4星随机碎片",12004,4,4,null,null,"地",4,null,"#10","12004#10","地系4星随机碎片",{"$f":"O3","v":7},7,7000,null,null,10003,"叶辽",11003,"叶辽碎片",5,11003,5,null,null,"11010#50","11010",5]
[0,12005,"风系4星随机碎片",12005,4,2,null,null,"风",4,null,"#10","12005#10","风系4星随机碎片",{"$f":"O4","v":7},7,7000,null,null,10004,"孔谦",11004,"孔谦碎片",5,11004,5,null,null,"11021#50","11021",5]
[0,12006,"光系4星随机碎片",12006,4,5,null,null,"光",4,null,"#10","12006#10","光系4星随机碎片",20,20,20000,null,null,10005,"兰卿",11005,"兰卿碎片",5,11005,5,null,null,"11036#40","11036",4]
[0,12007,"暗系4星随机碎片",12007,4,6,null,null,"暗",4,null,"#10","12007#10","暗系4星随机碎片",20,20,20000,null,null,10006,"朱贺",11006,"朱贺碎片",5,11006,5,null,null,"11037#40","11037",4]
[0,12008,"水系5星随机碎片",12008,5,3,null,null,"水",5,null,"#10","12008#10","水系5星随机碎片",24,24,24000,null,null,10007,"应茹",11007,"应茹碎片",5,11007,5,null,null,"11039#40","11039",4]
[0,12009,"火系5星随机碎片",12009,5,1,null,null,"火",5,null,"#10","12009#10","火系5星随机碎片",{"$f":"O8","v":24},24,24000,null,null,10008,"颜无雍",11008,"颜无雍碎片",5,11008,5,null,null,"11043#40","11043",4]
[0,12010,"地系5星随机碎片",12010,5,4,null,null,"地",5,null,"#10","12010#10","地系5星随机碎片",{"$f":"O9","v":24},24,24000,null,null,10009,"祁菲",11009,"祁菲碎片",5,11009,5,null,null,"14036#50","14036",4]
[0,12011,"风系5星随机碎片",12011,5,2,"属性",null,"风",5,null,"#10","12011#10","风系5星随机碎片",{"$f":"O10","v":24},24,24000,null,null,10010,"颜祈佳",11010,"颜祈佳碎片",5,11010,5,null,null,"14037#50","14037",4]
[1,10006,"朱贺",{"$f":"VLOOKUP(B12,$T:$W,3,FALSE)","v":11006},5,1,1,"火","光暗",5,null,"#10","12019#10","光暗5星随机碎片",28,28,28000,null,null,10011,"尹正霄",11011,"尹正霄碎片",5,11011,5,null,null,"14039#50","14039",4]
[1,10012,"慕容子期",{"$f":"VLOOKUP(B13,$T:$W,3,FALSE)","v":11012},5,1,2,"风",{"$f":"VLOOKUP(F12,$G$12:$H$17,2,FALSE)","v":"火"},{"$f":"IF(B12<13000,E12,51)","v":5},{"$f":"IF(--MID(D12,2,1)=1,IF(--RIGHT(D12,2)<24,50,40),50)","v":50},{"$f":"\"#\"&K13","v":"#50"},{"$f":"D12&L13","v":"11006#50"},{"$f":"C12","v":"朱贺"},{"$f":"VLOOKUP(J13,$G$23:$H$25,2,FALSE)","v":3.8571428571428568},{"$f":"O13/4","v":0.9642857142857142},{"$f":"ROUND(P13*1000,0)","v":964},null,null,10012,"慕容子期",11012,"慕容子期碎片",5,11012,5,null,null,"14043#50","14043",4]
[1,10016,"枫元正",11016,5,1,3,"水","火",5,{"$f":"IF(--MID(D13,2,1)=1,IF(--RIGHT(D13,2)<24,50,40),50)","v":50},{"$f":"\"#\"&K14","v":"#50"},"11012#50","慕容子期",{"$f":"VLOOKUP(J14,$G$23:$H$25,2,FALSE)","v":3.8571428571428568},{"$f":"O14/4","v":0.9642857142857142},964,null,null,10013,"白梦凡",11013,"白梦凡碎片",5,11013,5,null,null,"12002#10","12002",4]
[1,10020,"司空染",11020,5,1,4,"地","火",5,50,"#50","11016#50","枫元正",3.8571428571428568,0.9642857142857142,964,null,null,10014,"颜无诡",11014,"颜无诡碎片",5,11014,5,null,null,"12008#10","12008",5]
[1,10025,"炎琪儿",11025,4,1,5,"光","火",5,50,"#50","11020#50","司空染",3.8571428571428568,0.9642857142857142,964,null,null,10015,"凝儿",11015,"凝儿碎片",5,11015,5,null,null,"11006#50","11006",5]
[1,10038,"伏冥",11038,4,1,6,"暗","火",4,40,"#40","11025#40","炎琪儿",60,15,15000,null,null,10016,"枫元正",11016,"枫元正碎片",5,11016,5,null,null,"11012#50","11012",5]
[1,10040,"贾裴武",11040,4,1,null,null,"火",4,40,"#40","11038#40","伏冥",60,15,15000,null,null,10017,"解幽",11017,"解幽碎片",5,11017,5,null,null,"11016#50","11016",5]
[1,10041,"孟灿",11041,4,1,null,null,"火",4,40,"#40","11040#40","贾裴武",60,15,15000,null,null,10018,"紫苏",11018,"紫苏碎片",5,11018,5,null,null,"11020#50","11020",5]
[1,13025,"炎琪儿",14025,5,1,null,null,"火",4,40,"#40","11041#40","孟灿",60,15,15000,null,null,10019,"云",11019,"云碎片",5,11019,5,null,null,"11025#40","11025",4]
[1,13038,"伏冥",14038,5,1,null,null,"火",51,50,"#50","14025#50","炎琪儿",5.142857142857143,1.2857142857142858,1286,null,null,10020,"司空染",11020,"司空染碎片",5,11020,5,null,null,"11038#40","11038",4]
[1,13040,"贾裴武",14040,5,1,"权重",null,"火",51,50,"#50","14038#50","伏冥",5.142857142857143,1.2857142857142858,1286,null,null,10021,"清然",11021,"清然碎片",5,11021,5,null,null,"11040#40","11040",4]
[1,13041,"孟灿",14041,5,1,4,60,"火",51,{"$f":"IF(--MID(D22,2,1)=1,IF(--RIGHT(D22,2)<24,50,40),50)","v":50},"#50","14040#50","贾裴武",5.142857142857143,1.2857142857142858,1286,null,null,10022,"云灵",11022,"云灵碎片",5,11022,5,null,null,"11041#40","11041",4]
[2,10002,"石御霏",11002,5,2,5,{"$f":"9-H25","v":3.8571428571428568},"火",51,50,"#50","14041#50","孟灿",5.142857142857143,1.2857142857142858,1286,null,null,10023,"荧荧",11023,"荧荧碎片",5,11023,5,null,null,"14025#50","14025",4]
[2,10004,"孔谦",11004,5,2,51,{"$f":"9/7*4","v":5.142857142857143},"风",5,50,"#50","11002#50","石御霏",3.8571428571428568,{"$f":"O25/5","v":0.7714285714285714},771,null,null,10024,"许槿然",11024,"许槿然碎片",4,11024,4,null,null,"14038#50","14038",4]
[2,10008,"颜无雍",11008,5,2,null,null,"风",5,50,"#50","11004#50","孔谦",3.8571428571428568,{"$f":"O26/5","v":0.7714285714285714},771,null,null,10025,"炎琪儿",11025,"炎琪儿碎片",4,11025,4,null,null,"14040#50","14040",4]
[2,10019,"云",11019,5,2,null,null,"风",5,50,"#50","11008#50","颜无雍",3.8571428571428568,{"$f":"O27/5","v":0.7714285714285714},771,null,null,10026,"楚恒",11026,"楚恒碎片",4,11026,4,null,null,"14041#50","14041",4]
[2,10022,"云灵",11022,5,2,null,null,"风",5,50,"#50","11019#50","云",3.8571428571428568,{"$f":"O28/5","v":0.7714285714285714},771,null,null,10027,"柳月",11027,"柳月碎片",4,11027,4,null,null,"12003#10","12003",4]
[2,10024,"许槿然",11024,4,2,null,null,"风",5,50,"#50","11022#50","云灵",3.8571428571428568,{"$f":"O29/5","v":0.7714285714285714},771,null,null,10028,"岑以航",11028,"岑以航碎片",4,11028,4,null,null,"12009#10","12009",5]
[2,10030,"晏息",11030,4,2,null,null,"风",4,40,"#40","11024#40","许槿然",60,{"$f":"O30/4","v":15},15000,null,null,10029,"姜燧",11029,"姜燧碎片",4,11029,4,null,null,"11002#50","11002",5]
[2,10042,"白木",11042,4,2,null,null,"风",4,40,"#40","11030#40","晏息",60,15,15000,null,null,10030,"晏息",11030,"晏息碎片",4,11030,4,null,null,"11004#50","11004",5]
[2,10045,"殷婉儿",11045,4,2,null,null,"风",{"$f":"IF(B31<13000,E31,51)","v":4},40,"#40","11042#40","白木",60,15,15000,null,null,10031,"冉宜",11031,"冉宜碎片",4,11031,4,null,null,"11008#50","11008",5]
[2,13024,"许槿然",14024,5,2,"光暗权重",null,"风",4,40,"#40","11045#40","殷婉儿",60,15,15000,null,null,10032,"孙晴",11032,"孙晴碎片",4,11032,4,null,null,"11019#50","11019",5]
[2,13030,"晏息",14030,5,2,4,23.3,"风",51,50,"#50","14024#50","许槿然",5.142857142857143,1.2857142857142858,1286,null,null,10033,"艾欣",11033,"艾欣碎片",4,11033,4,null,null,"11022#50","11022",5]
[2,13042,"白木",14042,5,2,5,{"$f":"8.7/7*3","v":3.7285714285714278},"风",51,50,"#50","14030#50","晏息",5.142857142857143,1.2857142857142858,1286,null,null,10034,"影蓟",11034,"影蓟碎片",4,11034,4,null,null,"11024#40",{"$f":"LEFT(AC35,5)","v":"11024"},{"$f":"VLOOKUP(--AD35,$Y:$Z,2,FALSE)","v":4}]
[2,13045,"殷婉儿",14045,5,2,51,{"$f":"8.7-H35","v":4.9714285714285715},{"$f":"VLOOKUP(F35,$G$12:$H$17,2,FALSE)","v":"风"},51,50,"#50",{"$f":"D35&L36","v":"14042#50"},"白木",5.142857142857143,1.2857142857142858,{"$f":"ROUND(P36*1000,0)","v":1286},null,null,10035,"辛夷",11035,"辛夷碎片",4,11035,4,null,null,"11030#40","11030",4]
[3,10001,"夏侯鸿天",11001,5,3,null,null,"风",51,50,"#50","14045#50","殷婉儿",5.142857142857143,1.2857142857142858,1286,null,null,10036,"岑以璇",11036,"岑以璇碎片",4,11036,4,null,null,"11042#40","11042",4]
[3,10007,"应茹",11007,5,3,null,null,"水",5,50,"#50","11001#50","夏侯鸿天",3.8571428571428568,0.9642857142857142,964,null,null,10037,"薛苓",11037,"薛苓碎片",4,11037,4,null,null,"11045#40","11045",4]
[3,10010,"颜祈佳",11010,5,3,null,null,"水",5,50,"#50","11007#50","应茹",3.8571428571428568,0.9642857142857142,964,null,null,10038,"伏冥",11038,"伏冥碎片",4,11038,4,null,null,"14024#50","14024",4]
[3,10021,"清然",11021,5,3,null,null,"水",5,50,"#50","11010#50","颜祈佳",3.8571428571428568,0.9642857142857142,964,null,null,10039,"呼延腾",11039,"呼延腾碎片",4,11039,4,null,null,"14030#50","14030",4]
[3,10036,"岑以璇",11036,4,3,null,null,"水",5,50,"#50","11021#50","清然",3.8571428571428568,0.9642857142857142,964,null,null,10040,"贾裴武",11040,"贾裴武碎片",4,11040,4,null,null,"14042#50","14042",4]
[3,10037,"薛苓",11037,4,3,null,null,"水",4,40,"#40","11036#40","岑以璇",60,15,15000,null,null,10041,"孟灿",11041,"孟灿碎片",4,11041,4,null,null,"14045#50","14045",4]
[3,10039,"呼延腾",11039,4,3,null,null,"水",4,40,"#40","11037#40","薛苓",60,15,15000,null,null,10042,"白木",11042,"白木碎片",4,11042,4,null,null,"12005#10","12005",4]
[3,10043,"紫川",11043,4,3,null,null,"水",4,40,"#40","11039#40","呼延腾",60,15,15000,null,null,10043,"紫川",11043,"紫川碎片",4,11043,4,null,null,"12011#10","12011",5]
[3,13036,"岑以璇",14036,5,3,null,null,"水",4,40,"#40","11043#40","紫川",60,15,15000,null,null,10044,"靖之",11044,"靖之碎片",4,11044,4,null,null,"11003#50","11003",5]
[3,13037,"薛苓",14037,5,3,null,null,"水",51,50,{"$f":"\"#\"&K46","v":"#50"},"14036#50","岑以璇",{"$f":"VLOOKUP(J46,$G$23:$H$25,2,FALSE)","v":5.142857142857143},1.2857142857142858,1286,null,null,10045,"殷婉儿",11045,"殷婉儿碎片",4,11045,4,null,null,"11005#50","11005",5]
[3,13039,"呼延腾",14039,5,3,null,null,"水",51,50,"#50","14037#50","薛苓",5.142857142857143,1.2857142857142858,1286,null,null,10046,"林越",11046,"林越碎片",4,11046,4,null,null,"11011#50","11011",5]
[3,13043,"紫川",14043,5,3,null,null,"水",51,50,"#50","14039#50","呼延腾",5.142857142857143,1.2857142857142858,1286,null,null,13024,"许槿然",14024,"许槿然5星碎片",null,11047,3,null,null,"11013#50","11013",5]
[4,10003,"叶辽",11003,5,4,null,null,"水",51,50,"#50","14043#50","紫川",5.142857142857143,1.2857142857142858,1286,null,null,13025,"炎琪儿",14025,"炎琪儿5星碎片",null,11048,3,null,null,"11018#50","11018",5]
[4,10005,"兰卿",11005,5,4,null,null,"地",5,50,"#50","11003#50","叶辽",3.8571428571428568,{"$f":"O50/5","v":0.7714285714285714},771,null,null,13026,"楚恒",14026,"楚恒5星碎片",null,11049,3,null,null,"11029#40","11029",4]
[4,10011,"尹正霄",11011,5,4,null,null,"地",5,50,"#50","11005#50","兰卿",3.8571428571428568,0.7714285714285714,771,null,null,13027,"柳月",14027,"柳月5星碎片",null,11050,3,null,null,"11031#40","11031",4]
[4,10013,"白梦凡",11013,5,4,null,null,"地",5,50,"#50","11011#50","尹正霄",3.8571428571428568,0.7714285714285714,771,null,null,13028,"岑以航",14028,"岑以航5星碎片",null,11051,3,null,null,"11032#40","11032",4]
[4,10018,"紫苏",11018,5,4,null,null,"地",5,50,"#50","11013#50","白梦凡",3.8571428571428568,0.7714285714285714,771,null,null,13029,"姜燧",14029,"姜燧5星碎片",null,11052,3,null,null,"11033#40","11033",4]
[4,10029,"姜燧",11029,4,4,null,null,"地",5,50,"#50","11018#50","紫苏",3.8571428571428568,0.7714285714285714,771,null,null,13030,"晏息",14030,"晏息5星碎片",null,12001,3,null,null,"14029#50","14029",4]
[4,10031,"冉宜",11031,4,4,null,null,"地",4,{"$f":"IF(--MID(D54,2,1)=1,IF(--RIGHT(D54,2)<24,50,40),50)","v":40},"#40","11029#40","姜燧",60,{"$f":"O55/4","v":15},15000,null,null,13031,"冉宜",14031,"冉宜5星碎片",null,12002,4,null,null,"14031#50","14031",4]
[4,10032,"孙晴",11032,4,4,null,null,"地",4,40,"#40","11031#40","冉宜",60,15,15000,null,null,13032,"孙晴",14032,"孙晴5星碎片",null,12003,4,null,null,"14032#50","14032",4]
[4,10033,"艾欣",11033,4,4,null,null,"地",4,40,"#40","11032#40","孙晴",60,15,15000,null,null,13033,"艾欣",14033,"艾欣5星碎片",null,12004,4,null,null,"14033#50","14033",4]
[4,13029,"姜燧",14029,5,4,null,null,"地",4,40,"#40","11033#40","艾欣",60,15,15000,null,null,13034,"影蓟",14034,"影蓟5星碎片",null,12005,4,null,null,"12004#10","12004",4]
[4,13031,"冉宜",14031,5,4,null,null,"地",51,50,"#50","14029#50","姜燧",5.142857142857143,1.2857142857142858,1286,null,null,13035,"辛夷",14035,"辛夷5星碎片",null,12006,4,null,null,"12010#10","12010",5]
[4,13032,"孙晴",14032,5,4,null,null,"地",51,50,"#50","14031#50","冉宜",5.142857142857143,1.2857142857142858,1286,null,null,13036,"岑以璇",14036,"岑以璇5星碎片",null,12007,4,null,null,"11015#50","11015",5]
[4,13033,"艾欣",14033,5,4,null,null,"地",51,50,"#50","14032#50","孙晴",5.142857142857143,1.2857142857142858,1286,null,null,13037,"薛苓",14037,"薛苓5星碎片",null,12008,5,null,null,"11023#50","11023",5]
[5,10015,"凝儿",11015,5,5,null,null,"地",51,50,"#50","14033#50","艾欣",5.142857142857143,1.2857142857142858,1286,null,null,13038,"伏冥",14038,"伏冥5星碎片",null,12009,5,null,null,"11026#40","11026",4]
[5,10023,"荧荧",11023,5,5,null,null,"光",5,50,"#50","11015#50","凝儿",{"$f":"VLOOKUP(J63,$G$34:$H$36,2,FALSE)","v":3.7285714285714278},{"$f":"O63/5","v":0.7457142857142856},746,null,null,13039,"呼延腾",14039,"呼延腾5星碎片",null,12010,5,null,null,"11027#40","11027",4]
[5,10026,"楚恒",11026,4,5,null,null,"光",{"$f":"IF(B63<13000,E63,51)","v":5},50,"#50","11023#50","荧荧",{"$f":"VLOOKUP(J64,$G$34:$H$36,2,FALSE)","v":3.7285714285714278},{"$f":"O64/5","v":0.7457142857142856},746,null,null,13040,"贾裴武",14040,"贾裴武5星碎片",null,12011,5,null,null,"11028#40","11028",4]
[5,10027,"柳月",11027,4,5,null,null,"光",4,40,"#40","11026#40","楚恒",23.3,{"$f":"O65/7","v":3.3285714285714287},3329,null,null,13041,"孟灿",14041,"孟灿5星碎片",null,12012,4,null,null,"11046#40","11046",4]
[5,10028,"岑以航",11028,4,5,null,null,"光",4,40,"#40","11027#40","柳月",23.3,3.3285714285714287,3329,null,null,13042,"白木",14042,"白木5星碎片",null,12013,5,null,null,"14026#50","14026",4]
[5,10046,"林越",11046,4,5,null,null,"光",4,40,"#40","11028#40",{"$f":"C66","v":"岑以航"},23.3,3.3285714285714287,3329,null,null,13043,"紫川",14043,"紫川5星碎片",null,12014,5,null,null,"14027#50","14027",{"$f":"VLOOKUP(--AD67,$Y:$Z,2,FALSE)","v":4}]
[5,13026,"楚恒",14026,5,5,null,null,"光",4,40,"#40","11046#40","林越",23.3,3.3285714285714287,3329,null,null,13044,"靖之",14044,"靖之5星碎片",null,12015,5,null,null,"14028#50","14028",4]
[5,13027,"柳月",14027,5,5,null,null,"光",51,50,"#50","14026#50","楚恒",4.9714285714285715,0.710204081632653,710,null,null,13045,"殷婉儿",14045,"殷婉儿5星碎片",null,12016,5,null,null,"14046#50","14046",4]
[5,13028,"岑以航",14028,5,5,null,null,"光",51,50,"#50","14027#50","柳月",4.9714285714285715,0.710204081632653,710,null,null,13046,"林越",14046,"林越5星碎片",null,12017,5,null,null,"11009#50","11009",5]
[5,13046,"林越",14046,5,5,null,null,"光",51,50,"#50","14028#50","岑以航",4.9714285714285715,{"$f":"O71/7","v":0.710204081632653},710,{"$nulls":7},12018,5,null,null,"11014#50","11014",5]
[6,10009,"祁菲",11009,5,6,null,null,"光",51,50,"#50","14046#50","林越",4.9714285714285715,0.710204081632653,710,{"$nulls":7},12019,5,null,null,"11017#50","11017",5]
[6,10014,"颜无诡",11014,5,6,null,null,"暗",5,50,"#50","11009#50","祁菲",3.7285714285714278,{"$f":"O73/5","v":0.7457142857142856},746,{"$nulls":7},13024,4,null,null,"11034#40","11034",4]
[6,10017,"解幽",11017,5,6,null,null,"暗",5,50,"#50","11014#50","颜无诡",3.7285714285714278,{"$f":"O74/5","v":0.7457142857142856},746,{"$nulls":7},13025,4,null,null,"11035#40","11035",4]
[6,10034,"影蓟",11034,4,6,null,null,"暗",5,50,"#50","11017#50","解幽",3.7285714285714278,{"$f":"O75/5","v":0.7457142857142856},746,{"$nulls":7},13026,4,null,null,"11044#40","11044",4]
[6,10035,"辛夷",11035,4,6,null,null,"暗",4,40,"#40","11034#40","影蓟",23.3,3.3285714285714287,3329,{"$nulls":7},13027,4,null,null,"14034#50","14034",4]
[6,10044,"靖之",{"$f":"VLOOKUP(B77,$T:$W,3,FALSE)","v":11044},4,6,null,null,"暗",4,40,"#40","11035#40","辛夷",23.3,3.3285714285714287,3329,{"$nulls":7},13028,4,null,null,"14035#50","14035",4]
[6,13034,"影蓟",14034,5,6,null,null,"暗",4,40,"#40","11044#40","靖之",23.3,3.3285714285714287,3329,{"$nulls":7},13029,4,null,null,"14044#50","14044",4]
[6,13035,"辛夷",14035,5,6,null,null,"暗",51,50,"#50","14034#50","影蓟",4.9714285714285715,0.710204081632653,710,{"$nulls":7},13030,4,null,null,"12006#10","12006",4]
[6,13044,"靖之",14044,5,6,null,null,"暗",51,50,"#50","14035#50","辛夷",4.9714285714285715,0.710204081632653,710,{"$nulls":7},13031,4,null,null,"12007#10","12007",4]
{"$rows_left_out":39}
{"sheet":"Sheet3","index":3,"n_rows":55,"n_cols":14,"rows_kept":55}
[]
[]
[{"$nulls":4},10007,"应茹"]
[{"$nulls":4},10008,"颜无雍",{"$nulls":5},"10001#1",{"$f":"--LEFT(L4,5)","v":10001},{"$f":"VLOOKUP(M4,[2]ItemConfig!$B:$C,2,FALSE)","v":"伏羲"}]
[{"$nulls":4},10010,"颜祈佳",{"$nulls":5},"10002#1",{"$f":"--LEFT(L5,5)","v":10002},{"$f":"VLOOKUP(M5,[2]ItemConfig!$B:$C,2,FALSE)","v":"洛神"}]
[{"$nulls":4},10011,"尹正霄",{"$nulls":5},"10003#1",10003,{"$f":"VLOOKUP(M6,[2]ItemConfig!$B:$C,2,FALSE)","v":"猪八戒"}]
[{"$nulls":4},10016,"枫元正",{"$nulls":5},"10004#1",10004,{"$f":"VLOOKUP(M7,[2]ItemConfig!$B:$C,2,FALSE)","v":"慈航道人"}]
[{"$nulls":4},10018,"紫苏",{"$nulls":5},"10005#1",10005,{"$f":"VLOOKUP(M8,[2]ItemConfig!$B:$C,2,FALSE)","v":"妲己"}]
[{"$nulls":4},10019,"云",{"$nulls":5},"10006#1",10006,{"$f":"VLOOKUP(M9,[2]ItemConfig!$B:$C,2,FALSE)","v":"共工"}]
[{"$nulls":4},10021,"清然",{"$nulls":5},"10007#1",10007,{"$f":"VLOOKUP(M10,[2]ItemConfig!$B:$C,2,FALSE)","v":"唐僧"}]
[{"$nulls":4},10022,"云灵",{"$nulls":5},"10008#1",10008,{"$f":"VLOOKUP(M11,[2]ItemConfig!$B:$C,2,FALSE)","v":"精卫"}]
[{"$nulls":11},"10009#1",10009,{"$f":"VLOOKUP(M12,[2]ItemConfig!$B:$C,2,FALSE)","v":"龙吉公主"}]
[{"$nulls":11},"10010#1",10010,{"$f":"VLOOKUP(M13,[2]ItemConfig!$B:$C,2,FALSE)","v":"孔雀明王"}]
[{"$nulls":11},"10011#1",10011,{"$f":"VLOOKUP(M14,[2]ItemConfig!$B:$C,2,FALSE)","v":"雷震子"}]
[{"$nulls":11},"10012#1",10012,{"$f":"VLOOKUP(M15,[2]ItemConfig!$B:$C,2,FALSE)","v":"降龙罗汉"}]
[{"$nulls":11},"10013#1",10013,{"$f":"VLOOKUP(M16,[2]ItemConfig!$B:$C,2,FALSE)","v":"吕洞宾"}]
[{"$nulls":11},"10014#1",10014,{"$f":"VLOOKUP(M17,[2]ItemConfig!$B:$C,2,FALSE)","v":"哪吒"}]
[{"$nulls":11},"10015#1",10015,{"$f":"VLOOKUP(M18,[2]ItemConfig!$B:$C,2,FALSE)","v":"伏虎罗汉"}]
[{"$nulls":11},"10016#1",10016,{"$f":"VLOOKUP(M19,[2]ItemConfig!$B:$C,2,FALSE)","v":"蚩尤"}]
[{"$nulls":11},"10017#1",10017,{"$f":"VLOOKUP(M20,[2]ItemConfig!$B:$C,2,FALSE)","v":"嫦娥"}]
[{"$nulls":11},"10018#1",10018,{"$f":"VLOOKUP(M21,[2]ItemConfig!$B:$C,2,FALSE)","v":"九命猫"}]
[{"$nulls":11},"10019#1",10019,{"$f":"VLOOKUP(M22,[2]ItemConfig!$B:$C,2,FALSE)","v":"巨灵神"}]
[{"$nulls":11},"10020#1",10020,{"$f":"VLOOKUP(M23,[2]ItemConfig!$B:$C,2,FALSE)","v":"姑获鸟"}]
[{"$nulls":11},"10021#1",10021,{"$f":"VLOOKUP(M24,[2]ItemConfig!$B:$C,2,FALSE)","v":"东陵圣母"}]
[{"$nulls":11},"10022#1",10022,{"$f":"VLOOKUP(M25,[2]ItemConfig!$B:$C,2,FALSE)","v":"达摩"}]
[{"$nulls":11},"10023#1",10023,{"$f":"VLOOKUP(M26,[2]ItemConfig!$B:$C,2,FALSE)","v":"孙悟空"}]
[{"$nulls":11},"10024#1",10024,{"$f":"VLOOKUP(M27,[2]ItemConfig!$B:$C,2,FALSE)","v":"姜子牙"}]
[{"$nulls":11},"10025#1",10025,{"$f":"VLOOKUP(M28,[2]ItemConfig!$B:$C,2,FALSE)","v":"道德天尊"}]
[{"$nulls":11},"10026#1",10026,{"$f":"VLOOKUP(M29,[2]ItemConfig!$B:$C,2,FALSE)","v":"东华帝君"}]
[{"$nulls":11},"10027#1",10027,{"$f":"VLOOKUP(M30,[2]ItemConfig!$B:$C,2,FALSE)","v":"孟婆"}]
[{"$nulls":11},"10028#1",10028,{"$f":"VLOOKUP(M31,[2]ItemConfig!$B:$C,2,FALSE)","v":"石矶娘娘"}]
[{"$nulls":11},"10029#1",10029,{"$f":"VLOOKUP(M32,[2]ItemConfig!$B:$C,2,FALSE)","v":"月光菩萨"}]
[{"$nulls":11},"10030#1",10030,{"$f":"VLOOKUP(M33,[2]ItemConfig!$B:$C,2,FALSE)","v":"梵天"}]
[{"$nulls":11},"10031#1",10031,{"$f":"VLOOKUP(M34,[2]ItemConfig!$B:$C,2,FALSE)","v":"红孩儿"}]
[{"$nulls":11},"10032#1",10032,{"$f":"VLOOKUP(M35,[2]ItemConfig!$B:$C,2,FALSE)","v":"吴刚"}]
[{"$nulls":11},"10033#1",10033,{"$f":"VLOOKUP(M36,[2]ItemConfig!$B:$C,2,FALSE)","v":"净光天女"}]
[{"$nulls":11},"10034#1",{"$f":"--LEFT(L37,5)","v":10034},{"$f":"VLOOKUP(M37,[2]ItemConfig!$B:$C,2,FALSE)","v":"帝释天"}]
[{"$nulls":11},"10035#1",10035,{"$f":"VLOOKUP(M38,[2]ItemConfig!$B:$C,2,FALSE)","v":"妈祖"}]
[{"$nulls":11},"10036#1",10036,{"$f":"VLOOKUP(M39,[2]ItemConfig!$B:$C,2,FALSE)","v":"赵公明"}]
[{"$nulls":11},"10037#1",10037,{"$f":"VLOOKUP(M40,[2]ItemConfig!$B:$C,2,FALSE)","v":"罗刹"}]
[{"$nulls":11},"10038#1",10038,{"$f":"VLOOKUP(M41,[2]ItemConfig!$B:$C,2,FALSE)","v":"夜叉"}]
[{"$nulls":11},"10039#1",10039,{"$f":"VLOOKUP(M42,[2]ItemConfig!$B:$C,2,FALSE)","v":"普贤菩萨"}]
[{"$nulls":11},"10040#1",10040,{"$f":"VLOOKUP(M43,[2]ItemConfig!$B:$C,2,FALSE)","v":"杨戬"}]
[{"$nulls":11},"10041#1",10041,{"$f":"VLOOKUP(M44,[2]ItemConfig!$B:$C,2,FALSE)","v":"通天教主"}]
[{"$nulls":11},"10042#1",10042,{"$f":"VLOOKUP(M45,[2]ItemConfig!$B:$C,2,FALSE)","v":"九天玄女"}]
[{"$nulls":11},"10043#1",10043,{"$f":"VLOOKUP(M46,[2]ItemConfig!$B:$C,2,FALSE)","v":"太阴星君"}]
[{"$nulls":11},"10044#1",10044,{"$f":"VLOOKUP(M47,[2]ItemConfig!$B:$C,2,FALSE)","v":"混世魔王"}]
[{"$nulls":11},"10045#1",10045,{"$f":"VLOOKUP(M48,[2]ItemConfig!$B:$C,2,FALSE)","v":"百花仙子"}]
[{"$nulls":11},"10046#1",10046,{"$f":"VLOOKUP(M49,[2]ItemConfig!$B:$C,2,FALSE)","v":"女英"}]
[{"$nulls":11},"10047#1",10047,{"$f":"VLOOKUP(M50,[2]ItemConfig!$B:$C,2,FALSE)","v":"大火妖"}]
[{"$nulls":11},"10048#1",10048,{"$f":"VLOOKUP(M51,[2]ItemConfig!$B:$C,2,FALSE)","v":"雪女"}]
[{"$nulls":11},"10049#1",10049,{"$f":"VLOOKUP(M52,[2]ItemConfig!$B:$C,2,FALSE)","v":"娜迦王"}]
[{"$nulls":11},"10050#1",10050,{"$f":"VLOOKUP(M53,[2]ItemConfig!$B:$C,2,FALSE)","v":"摩呼"}]
[{"$nulls":11},"10051#1",10051,{"$f":"VLOOKUP(M54,[2]ItemConfig!$B:$C,2,FALSE)","v":"半仙"}]
[{"$nulls":11},"10052#1",10052,{"$f":"VLOOKUP(M55,[2]ItemConfig!$B:$C,2,FALSE)","v":"荷莲"}]