{"text_format":"3","workbook":"xlsx","n_sheets":3,"sheets":["EquipPropertyPool","Sheet1","Sheet2"],"not_rendered":{"external_links":1,"defined_names":2,"comments":1},"read":"whole","date_system":"1900"}

{"sheet":"EquipPropertyPool","index":0,"n_rows":650,"n_cols":8,"rows_kept":650}
[null,"id","PropertyId","Max","Min","PoolNum","Weight","NoUse"]
[null,"int","int","int","int","int","int","string"]
[null,2,2,2,2,2,2,0]
[null,"索引\n库*1000+属性id","属性","属性上限","属性下限","所属库编号","权重","备注"]
["默认值"]
["正确性校对"]
["校对值"]
[null,1001,5,65,53,1,100,"蓝色武器低档速度"]
[null,1002,5,76,69,2,100,"蓝色武器中档速度"]
[null,1003,5,88,80,3,100,"蓝色武器高档速度"]
[null,1004,53,233,100,4,100,"蓝色武器低档施法率"]
[null,1005,53,367,293,5,100,"蓝色武器中档施法率"]
[null,1006,53,500,427,6,100,"蓝色武器高档施法率"]
[null,1007,53,146,63,7,100,"蓝色武器低档施法率"]
[null,1008,53,229,183,8,100,"蓝色武器中档施法率"]
[null,1009,53,313,267,9,100,"蓝色武器高档施法率"]
[null,1010,55,117,50,10,100,"蓝色武器低档暴击率百分比"]
[null,1011,55,183,147,11,100,"蓝色武器中档暴击率百分比"]
[null,1012,55,250,213,12,100,"蓝色武器高档暴击率百分比"]
[null,1013,56,117,50,13,100,"蓝色武器低档暴击伤害百分比"]
[null,1014,56,183,147,14,100,"蓝色武器中档暴击伤害百分比"]
[null,1015,56,250,213,15,100,"蓝色武器高档暴击伤害百分比"]
[null,1016,1,484,396,16,100,"蓝色板甲低档生命"]
[null,1017,1,572,495,17,100,"蓝色板甲中档生命"]
[null,1018,1,660,583,18,100,"蓝色板甲高档生命"]
[null,1019,60,140,60,19,100,"蓝色板甲低档抗暴击"]
[null,1020,60,220,176,20,100,"蓝色板甲中档抗暴击"]
[null,1021,60,300,256,21,100,"蓝色板甲高档抗暴击"]
[null,1022,1,242,198,22,100,"蓝色鞋子低档生命"]
[null,1023,1,286,248,23,100,"蓝色鞋子中档生命"]
[null,1024,1,330,292,24,100,"蓝色鞋子高档生命"]
[null,1025,3,44,36,25,100,"蓝色鞋子低档护甲"]
[null,1026,3,52,45,26,100,"蓝色鞋子中档护甲"]
[null,1027,3,60,53,27,100,"蓝色鞋子高档护甲"]
[null,1028,4,44,36,28,100,"蓝色鞋子低档魔抗"]
[null,1029,4,52,45,29,100,"蓝色鞋子中档魔抗"]
[null,1030,4,60,53,30,100,"蓝色鞋子高档魔抗"]
[null,1031,3,44,36,31,100,"蓝色头饰低档护甲"]
[null,1032,3,52,45,32,100,"蓝色头饰中档护甲"]
[null,1033,3,60,53,33,100,"蓝色头饰高档护甲"]
[null,1034,4,44,36,34,100,"蓝色头饰低档魔抗"]
[null,1035,4,52,45,35,100,"蓝色头饰中档魔抗"]
[null,1036,4,60,53,36,100,"蓝色头饰高档魔抗"]
[null,1037,1,484,396,37,100,"蓝色戒指低档生命"]
[null,1038,1,572,495,38,100,"蓝色戒指中档生命"]
[null,1039,1,660,583,39,100,"蓝色戒指高档生命"]
[null,1040,3,44,36,40,100,"蓝色戒指低档护甲"]
[null,1041,3,52,45,41,100,"蓝色戒指中档护甲"]
[null,1042,3,60,53,42,100,"蓝色戒指高档护甲"]
[null,1043,4,44,36,43,100,"蓝色戒指低档魔抗"]
[null,1044,4,52,45,44,100,"蓝色戒指中档魔抗"]
[null,1045,4,60,53,45,100,"蓝色戒指高档魔抗"]
[null,1046,2,44,36,46,100,"蓝色腰带低档攻击"]
[null,1047,2,52,45,47,100,"蓝色腰带中档攻击"]
[null,1048,2,60,53,48,100,"蓝色腰带高档攻击"]
[null,1049,3,44,36,49,100,"蓝色腰带低档护甲"]
[null,1050,3,52,45,50,100,"蓝色腰带中档护甲"]
[null,1051,3,60,53,51,100,"蓝色腰带高档护甲"]
[null,1052,4,44,36,52,100,"蓝色腰带低档魔抗"]
[null,1053,4,52,45,53,100,"蓝色腰带中档魔抗"]
[null,1054,4,60,53,54,100,"蓝色腰带高档魔抗"]
[null,1055,5,88,72,55,100,"紫色武器低档速度"]
[null,1056,5,104,92,56,100,"紫色武器中档速度"]
[null,1057,5,120,108,57,100,"紫色武器高档速度"]
[null,1058,53,667,500,58,100,"紫色武器低档施法率"]
[null,1059,53,833,727,59,100,"紫色武器中档施法率"]
[null,1060,53,1000,893,60,100,"紫色武器高档施法率"]
[null,1061,53,333,250,61,100,"紫色武器低档施法率"]
[null,1062,53,417,363,62,100,"紫色武器中档施法率"]
[null,1063,53,500,447,63,100,"紫色武器高档施法率"]
[null,1064,55,333,250,64,100,"紫色武器低档暴击率百分比"]
[null,1065,55,417,363,65,100,"紫色武器中档暴击率百分比"]
[null,1066,55,500,447,66,100,"紫色武器高档暴击率百分比"]
[null,1067,56,333,250,67,100,"紫色武器低档暴击伤害百分比"]
[null,1068,56,417,363,68,100,"紫色武器中档暴击伤害百分比"]
[null,1069,56,500,447,69,100,"紫色武器高档暴击伤害百分比"]
[null,1070,1,807,660,70,100,"紫色板甲低档生命"]
[null,1071,1,953,818,71,100,"紫色板甲中档生命"]
[null,1072,1,1100,964,72,100,"紫色板甲高档生命"]
[null,1073,60,400,300,73,100,"紫色板甲低档抗暴击"]
[null,1074,60,500,436,74,100,"紫色板甲中档抗暴击"]
[null,1075,60,600,536,75,100,"紫色板甲高档抗暴击"]
[null,1076,58,351,302,76,100,"紫色板甲低档治疗百分比"]
[null,1077,58,401,381,77,100,"紫色板甲中档治疗百分比"]
[null,1078,58,450,431,78,100,"紫色板甲高档治疗百分比"]
[null,1079,57,351,302,79,100,"紫色板甲低档受治疗百分比"]
[null,1080,57,401,381,80,100,"紫色板甲中档受治疗百分比"]
[null,1081,57,450,431,81,100,"紫色板甲高档受治疗百分比"]
[null,1082,1,403,330,82,100,"紫色鞋子低档生命"]
[null,1083,1,477,409,83,100,"紫色鞋子中档生命"]
[null,1084,1,550,482,84,100,"紫色鞋子高档生命"]
[null,1085,58,351,302,85,100,"紫色鞋子低档治疗百分比"]
[null,1086,58,401,381,86,100,"紫色鞋子中档治疗百分比"]
[null,1087,58,450,431,87,100,"紫色鞋子高档治疗百分比"]
[null,1088,57,351,302,88,100,"紫色鞋子低档受治疗百分比"]
[null,1089,57,401,381,89,100,"紫色鞋子中档受治疗百分比"]
[null,1090,57,450,431,90,100,"紫色鞋子高档受治疗百分比"]
[null,1091,3,73,60,91,100,"紫色鞋子低档护甲"]
[null,1092,3,87,74,92,100,"紫色鞋子中档护甲"]
[null,1093,3,100,88,93,100,"紫色鞋子高档护甲"]
[null,1094,4,73,60,94,100,"紫色鞋子低档魔抗"]
[null,1095,4,87,74,95,100,"紫色鞋子中档魔抗"]
[null,1096,4,100,88,96,100,"紫色鞋子高档魔抗"]
[null,1097,55,133,100,97,100,"紫色鞋子低档暴击率百分比"]
[null,1098,55,167,145,98,100,"紫色鞋子中档暴击率百分比"]
[null,1099,55,200,179,99,100,"紫色鞋子高档暴击率百分比"]
[null,1100,56,133,100,100,100,"紫色鞋子低档暴击伤害百分比"]
[null,1101,56,167,145,101,100,"紫色鞋子中档暴击伤害百分比"]
[null,1102,56,200,179,102,100,"紫色鞋子高档暴击伤害百分比"]
[null,1103,3,73,60,103,100,"紫色头饰低档护甲"]
[null,1104,3,87,74,104,100,"紫色头饰中档护甲"]
[null,1105,3,100,88,105,100,"紫色头饰高档护甲"]
[null,1106,4,73,60,106,100,"紫色头饰低档魔抗"]
[null,1107,4,87,74,107,100,"紫色头饰中档魔抗"]
[null,1108,4,100,88,108,100,"紫色头饰高档魔抗"]
[null,1109,58,468,402,109,100,"紫色头饰低档治疗百分比"]
[null,1110,58,534,508,110,100,"紫色头饰中档治疗百分比"]
[null,1111,58,600,574,111,100,"紫色头饰高档治疗百分比"]
[null,1112,57,468,402,112,100,"紫色头饰低档受治疗百分比"]
[null,1113,57,534,508,113,100,"紫色头饰中档受治疗百分比"]
[null,1114,57,600,574,114,100,"紫色头饰高档受治疗百分比"]
[null,1115,55,200,150,115,100,"紫色头饰低档暴击率百分比"]
[null,1116,55,250,218,116,100,"紫色头饰中档暴击率百分比"]
[null,1117,55,300,268,117,100,"紫色头饰高档暴击率百分比"]
[null,1118,56,200,150,118,100,"紫色头饰低档暴击伤害百分比"]
[null,1119,56,250,218,119,100,"紫色头饰中档暴击伤害百分比"]
[null,1120,56,300,268,120,100,"紫色头饰高档暴击伤害百分比"]
[null,1121,61,197,170,121,100,"紫色戒指低档生命百分比"]
[null,1122,61,223,222,122,100,"紫色戒指中档生命百分比"]
[null,1123,61,250,248,123,100,"紫色戒指高档生命百分比"]
[null,1124,1,807,660,124,100,"紫色戒指低档生命"]
[null,1125,1,953,818,125,100,"紫色戒指中档生命"]
[null,1126,1,1100,964,126,100,"紫色戒指高档生命"]
[null,1127,3,73,60,127,100,"紫色戒指低档护甲"]
[null,1128,3,87,74,128,100,"紫色戒指中档护甲"]
[null,1129,3,100,88,129,100,"紫色戒指高档护甲"]
[null,1130,4,73,60,130,100,"紫色戒指低档魔抗"]
[null,1131,4,87,74,131,100,"紫色戒指中档魔抗"]
[null,1132,4,100,88,132,100,"紫色戒指高档魔抗"]
[null,1133,2,73,60,133,100,"紫色腰带低档攻击"]
[null,1134,2,87,74,134,100,"紫色腰带中档攻击"]
[null,1135,2,100,88,135,100,"紫色腰带高档攻击"]
[null,1136,61,197,170,136,100,"紫色腰带低档生命百分比"]
[null,1137,61,223,222,137,100,"紫色腰带中档生命百分比"]
[null,1138,61,250,248,138,100,"紫色腰带高档生命百分比"]
[null,1139,3,73,60,139,100,"紫色腰带低档护甲"]
[null,1140,3,87,74,140,100,"紫色腰带中档护甲"]
[null,1141,3,100,88,141,100,"紫色腰带高档护甲"]
[null,1142,4,73,60,142,100,"紫色腰带低档魔抗"]
[null,1143,4,87,74,143,100,"紫色腰带中档魔抗"]
[null,1144,4,100,88,144,100,"紫色腰带高档魔抗"]
[null,1145,5,143,126,145,100,"橙色武器低档速度"]
[null,1146,5,160,147,146,100,"橙色武器中下档速度"]
[null,1147,5,176,164,147,100,"橙色武器中上档速度"]
[null,1148,5,193,180,148,100,"橙色武器高档速度"]
[null,1149,5,210,197,149,100,"橙色武器顶级速度"]
[null,1150,53,1104,1005,150,100,"橙色武器低档施法率"]
[null,1151,53,1203,1124,151,100,"橙色武器中下档施法率"]
[null,1152,53,1302,1223,152,100,"橙色武器中上档施法率"]
[null,1153,53,1401,1322,153,100,"橙色武器高档施法率"]
[null,1154,53,1500,1421,154,100,"橙色武器顶级施法率"]
[null,1155,53,581,529,155,100,"橙色武器低档施法率"]
[null,1156,53,633,592,156,100,"橙色武器中下档施法率"]
[null,1157,53,685,644,157,100,"橙色武器中上档施法率"]
[null,1158,53,737,696,158,100,"橙色武器高档施法率"]
[null,1159,53,789,748,159,100,"橙色武器顶级施法率"]
[null,1160,55,552,503,160,100,"橙色武器低档暴击率百分比"]
[null,1161,55,602,562,161,100,"橙色武器中下档暴击率百分比"]
[null,1162,55,651,612,162,100,"橙色武器中上档暴击率百分比"]
[null,1163,55,701,661,163,100,"橙色武器高档暴击率百分比"]
[null,1164,55,750,711,164,100,"橙色武器顶级暴击率百分比"]
[null,1165,56,552,503,165,100,"橙色武器低档暴击伤害百分比"]
[null,1166,56,602,562,166,100,"橙色武器中下档暴击伤害百分比"]
[null,1167,56,651,612,167,100,"橙色武器中上档暴击伤害百分比"]
[null,1168,56,701,661,168,100,"橙色武器高档暴击伤害百分比"]
[null,1169,56,750,711,169,100,"橙色武器顶级暴击伤害百分比"]
[null,1170,101,360,300,170,100,"橙色武器低档属性伤害"]
[null,1171,101,420,370,171,100,"橙色武器中下档属性伤害"]
[null,1172,101,480,430,172,100,"橙色武器中上档属性伤害"]
[null,1173,101,540,490,173,100,"橙色武器高档属性伤害"]
[null,1174,101,600,550,174,100,"橙色武器顶级属性伤害"]
[null,1175,102,360,300,170,100,"橙色武器低档属性伤害"]
[null,1176,102,420,370,171,100,"橙色武器中下档属性伤害"]
[null,1177,102,480,430,172,100,"橙色武器中上档属性伤害"]
[null,1178,102,540,490,173,100,"橙色武器高档属性伤害"]
[null,1179,102,600,550,174,100,"橙色武器顶级属性伤害"]
[null,1180,103,360,300,170,100,"橙色武器低档属性伤害"]
[null,1181,103,420,370,171,100,"橙色武器中下档属性伤害"]
[null,1182,103,480,430,172,100,"橙色武器中上档属性伤害"]
[null,1183,103,540,490,173,100,"橙色武器高档属性伤害"]
[null,1184,103,600,550,174,100,"橙色武器顶级属性伤害"]
[null,1185,104,360,300,170,100,"橙色武器低档属性伤害"]
[null,1186,104,420,370,171,100,"橙色武器中下档属性伤害"]
[null,1187,104,480,430,172,100,"橙色武器中上档属性伤害"]
[null,1188,104,540,490,173,100,"橙色武器高档属性伤害"]
[null,1189,104,600,550,174,100,"橙色武器顶级属性伤害"]
[null,1190,105,360,300,170,100,"橙色武器低档属性伤害"]
[null,1191,105,420,370,171,100,"橙色武器中下档属性伤害"]
[null,1192,105,480,430,172,100,"橙色武器中上档属性伤害"]
[null,1193,105,540,490,173,100,"橙色武器高档属性伤害"]
{"$rows_left_out":451}
{"sheet":"Sheet1","index":1,"n_rows":77,"n_cols":19,"rows_kept":77}
[null,"库","属性","品质","属于","占比","min","max","id","min","max",{"$nulls":7},"共计"]
[{"$f":"D2&E2","v":"蓝色武器"},1,"速度","蓝色","武器",15,{"$f":"[1]辅助表!$AG$4*176*F2/100","v":11.22},{"$f":"G2/0.6","v":18.700000000000003},{"$f":"VLOOKUP(C2,[1]辅助表!Y:Z,2,0)","v":5},{"$f":"INT(G2)","v":11},{"$f":"INT(H2)","v":18},{"$nulls":5},"蓝色装备","效果命中",10]
[{"$f":"D3&E3","v":"蓝色武器"},1,"效果抵抗","蓝色","武器",50,5,5,{"$f":"VLOOKUP(C3,[1]辅助表!Y:Z,2,0)","v":54},{"$f":"INT(G3)","v":5},5,{"$nulls":6},"效果抵抗",10]
["蓝色武器",1,"效果命中","蓝色","武器",50,5,5,{"$f":"VLOOKUP(C4,[1]辅助表!Y:Z,2,0)","v":53},5,5]
["蓝色铠甲",2,"生命","蓝色","铠甲",21,{"$f":"2400*[1]辅助表!$AE$4*F5/100","v":235.276363636363},{"$f":"G5/0.6","v":392.12727272727165},{"$f":"VLOOKUP(C5,[1]辅助表!Y:Z,2,0)","v":1},235,392,{"$nulls":5},"紫色装备"]
["蓝色铠甲",2,"攻击","蓝色","铠甲",21,{"$f":"200*[1]辅助表!$AE$4*F6/100","v":19.606363636363586},{"$f":"G6/0.6","v":32.677272727272644},{"$f":"VLOOKUP(C6,[1]辅助表!Y:Z,2,0)","v":2},19,32,{"$nulls":6},"效果命中",16]
["蓝色铠甲",2,"效果命中","蓝色","铠甲",50,5,5,{"$f":"VLOOKUP(C7,[1]辅助表!Y:Z,2,0)","v":53},5,5,{"$nulls":6},"效果抵抗",16]
["蓝色铠甲",2,"效果抵抗","蓝色","铠甲",50,5,5,{"$f":"VLOOKUP(C8,[1]辅助表!Y:Z,2,0)","v":54},5,5,{"$nulls":6},"暴击率",10]
["蓝色鞋子",3,"生命","蓝色","鞋子",24,{"$f":"2400*[1]辅助表!$AE$4*F9/100","v":268.887272727272},{"$f":"G9/0.6","v":448.14545454545333},{"$f":"VLOOKUP(C9,[1]辅助表!Y:Z,2,0)","v":1},268,448,{"$nulls":6},"暴击伤害",45]
["蓝色鞋子",3,"攻击","蓝色","鞋子",19,{"$f":"200*[1]辅助表!$AE$4*F10/100","v":17.739090909090862},29.565151515151438,{"$f":"VLOOKUP(C10,[1]辅助表!Y:Z,2,0)","v":2},17,29]
["蓝色鞋子",3,"护甲","蓝色","鞋子",10,{"$f":"200*[1]辅助表!$AE$4*F11/100","v":9.336363636363613},15.560606060606021,{"$f":"VLOOKUP(C11,[1]辅助表!Y:Z,2,0)","v":3},9,15]
["蓝色鞋子",3,"魔抗","蓝色","鞋子",13,{"$f":"200*[1]辅助表!$AE$4*F12/100","v":12.137272727272695},20.228787878787827,{"$f":"VLOOKUP(C12,[1]辅助表!Y:Z,2,0)","v":4},12,20,{"$nulls":5},"橙色装备"]
["蓝色头饰",4,"护甲","蓝色","头饰",28,{"$f":"200*[1]辅助表!$AE$4*F13/100","v":26.141818181818113},43.56969696969686,{"$f":"VLOOKUP(C13,[1]辅助表!Y:Z,2,0)","v":3},26,43,{"$nulls":6},"效果命中",20]
["蓝色头饰",4,"魔抗","蓝色","头饰",29,{"$f":"200*[1]辅助表!$AE$4*F14/100","v":27.075454545454473},45.125757575757454,{"$f":"VLOOKUP(C14,[1]辅助表!Y:Z,2,0)","v":4},27,45,{"$nulls":6},"效果抵抗",20]
["蓝色头饰",4,"速度","蓝色","头饰",21,{"$f":"[1]辅助表!$AG$4*176*F15/100","v":15.708},26.18,{"$f":"VLOOKUP(C15,[1]辅助表!Y:Z,2,0)","v":5},15,26,{"$nulls":6},"暴击率",20]
["紫色武器",5,"速度","紫色","武器",15,{"$f":"176*[1]辅助表!$AG$5*F16/100","v":16.83},{"$f":"176*[1]辅助表!$AF$5*F16/100","v":19.8},{"$f":"VLOOKUP(C16,[1]辅助表!Y:Z,2,0)","v":5},{"$f":"INT(G16)","v":16},{"$f":"INT(H16)","v":19},{"$nulls":6},"暴击伤害",80]
["紫色武器",5,"效果抵抗","紫色","武器",50,8,8,{"$f":"VLOOKUP(C17,[1]辅助表!Y:Z,2,0)","v":54},8,8,{"$nulls":6},"火攻（%）",25]
["紫色武器",5,"效果命中","紫色","武器",50,8,8,{"$f":"VLOOKUP(C18,[1]辅助表!Y:Z,2,0)","v":53},8,8,{"$nulls":6},"风攻（%）",25]
["紫色武器",5,"暴击伤害","紫色","武器",60,25,25,{"$f":"VLOOKUP(C19,[1]辅助表!Y:Z,2,0)","v":56},25,25,{"$nulls":6},"水攻（%）",25]
["紫色武器",5,"暴击率","紫色","武器",22,5,5,{"$f":"VLOOKUP(C20,[1]辅助表!Y:Z,2,0)","v":55},5,5,{"$nulls":6},"地攻（%）",25]
["紫色铠甲",6,"生命","紫色","铠甲",21,{"$f":"2400*[1]辅助表!$AE$5*F21/100","v":302.4},{"$f":"G21/0.6","v":504},{"$f":"VLOOKUP(C21,[1]辅助表!Y:Z,2,0)","v":1},302,504,{"$nulls":6},"光攻（%）",25]
["紫色铠甲",6,"攻击","紫色","铠甲",21,{"$f":"200*[1]辅助表!$AE$5*F22/100","v":25.2},{"$f":"G22/0.6","v":42},{"$f":"VLOOKUP(C22,[1]辅助表!Y:Z,2,0)","v":2},25,42,{"$nulls":6},"暗攻（%）",25]
["紫色铠甲",6,"效果命中","紫色","铠甲",50,8,8,{"$f":"VLOOKUP(C23,[1]辅助表!Y:Z,2,0)","v":53},8,8,{"$nulls":6},"火抗（%）",20]
["紫色铠甲",6,"效果抵抗","紫色","铠甲",50,8,8,{"$f":"VLOOKUP(C24,[1]辅助表!Y:Z,2,0)","v":54},8,8,{"$nulls":6},"风抗（%）",20]
["紫色鞋子",7,"生命","紫色","鞋子",24,{"$f":"2400*[1]辅助表!$AE$5*F25/100","v":345.6},{"$f":"G25/0.6","v":576.0000000000001},{"$f":"VLOOKUP(C25,[1]辅助表!Y:Z,2,0)","v":1},345,576,{"$nulls":6},"水抗（%）",20]
["紫色鞋子",7,"攻击","紫色","鞋子",19,{"$f":"200*[1]辅助表!$AE$5*F26/100","v":22.8},{"$f":"G26/0.6","v":38},{"$f":"VLOOKUP(C26,[1]辅助表!Y:Z,2,0)","v":2},22,38,{"$nulls":6},"地抗（%）",20]
["紫色鞋子",7,"护甲","紫色","鞋子",10,{"$f":"200*[1]辅助表!$AE$5*F27/100","v":12},{"$f":"G27/0.6","v":20},{"$f":"VLOOKUP(C27,[1]辅助表!Y:Z,2,0)","v":3},12,20,{"$nulls":6},"光抗（%）",20]
["紫色鞋子",7,"魔抗","紫色","鞋子",13,{"$f":"200*[1]辅助表!$AE$5*F28/100","v":15.6},{"$f":"G28/0.6","v":26},{"$f":"VLOOKUP(C28,[1]辅助表!Y:Z,2,0)","v":4},15,26,{"$nulls":6},"暗抗（%）",20]
["紫色鞋子",7,"暴击率","紫色","鞋子",23,5,5,{"$f":"VLOOKUP(C29,[1]辅助表!Y:Z,2,0)","v":55},5,5]
["紫色鞋子",7,"暴击伤害","紫色","鞋子",20,10,10,{"$f":"VLOOKUP(C30,[1]辅助表!Y:Z,2,0)","v":56},10,10]
["紫色头饰",8,"护甲","紫色","头饰",28,{"$f":"200*[1]辅助表!$AE$5*F31/100","v":33.6},{"$f":"G31/0.6","v":56.00000000000001},{"$f":"VLOOKUP(C31,[1]辅助表!Y:Z,2,0)","v":3},33,56]
["紫色头饰",8,"魔抗","紫色","头饰",29,{"$f":"200*[1]辅助表!$AE$5*F32/100","v":34.8},{"$f":"G32/0.6","v":58},{"$f":"VLOOKUP(C32,[1]辅助表!Y:Z,2,0)","v":4},34,58]
["紫色头饰",8,"速度","紫色","头饰",21,{"$f":"176*[1]辅助表!$AG$5*F33/100","v":23.561999999999998},{"$f":"176*[1]辅助表!$AF$5*F33/100","v":27.72},{"$f":"VLOOKUP(C33,[1]辅助表!Y:Z,2,0)","v":5},23,27]
["紫色头饰",8,"暴击伤害","紫色","头饰",20,10,10,{"$f":"VLOOKUP(C34,[1]辅助表!Y:Z,2,0)","v":56},10,10]
["橙色武器",9,"速度","橙色","武器",15,{"$f":"176*[1]辅助表!$AG$6*F35/100","v":22.44},{"$f":"176*[1]辅助表!$AF$6*F35/100","v":26.4},{"$f":"VLOOKUP(C35,[1]辅助表!Y:Z,2,0)","v":5},{"$f":"INT(G35)","v":22},{"$f":"INT(H35)","v":26}]
["橙色武器",9,"效果抵抗","橙色","武器",50,10,10,{"$f":"VLOOKUP(C36,[1]辅助表!Y:Z,2,0)","v":54},10,10]
["橙色武器",9,"效果命中","橙色","武器",50,10,10,{"$f":"VLOOKUP(C37,[1]辅助表!Y:Z,2,0)","v":53},10,10]
["橙色武器",9,"暴击伤害","橙色","武器",60,40,40,{"$f":"VLOOKUP(C38,[1]辅助表!Y:Z,2,0)","v":56},40,40]
["橙色武器",9,"暴击率","橙色","武器",22,15,15,{"$f":"VLOOKUP(C39,[1]辅助表!Y:Z,2,0)","v":55},15,15]
["橙色武器",9,"火攻（%）","橙色","武器",15,8,15,{"$f":"VLOOKUP(C40,[1]辅助表!Y:Z,2,0)","v":101},8,15]
["橙色武器",9,"风攻（%）","橙色","武器",15,8,15,{"$f":"VLOOKUP(C41,[1]辅助表!Y:Z,2,0)","v":102},8,15]
["橙色武器",9,"水攻（%）","橙色","武器",15,8,15,{"$f":"VLOOKUP(C42,[1]辅助表!Y:Z,2,0)","v":103},8,15]
["橙色武器",9,"地攻（%）","橙色","武器",15,8,15,{"$f":"VLOOKUP(C43,[1]辅助表!Y:Z,2,0)","v":104},8,15]
["橙色武器",9,"光攻（%）","橙色","武器",15,8,15,{"$f":"VLOOKUP(C44,[1]辅助表!Y:Z,2,0)","v":105},8,15]
["橙色武器",9,"暗攻（%）","橙色","武器",15,8,15,{"$f":"VLOOKUP(C45,[1]辅助表!Y:Z,2,0)","v":106},8,15]
["橙色铠甲",10,"生命","橙色","铠甲",21,{"$f":"2400*[1]辅助表!$AE$6*F46/100","v":1608.2181818181823},{"$f":"G46/0.6","v":2680.3636363636374},{"$f":"VLOOKUP(C46,[1]辅助表!Y:Z,2,0)","v":1},1608,2680]
["橙色铠甲",10,"攻击","橙色","铠甲",21,{"$f":"200*[1]辅助表!$AE$6*F47/100","v":134.01818181818186},{"$f":"G47/0.6","v":223.36363636363643},{"$f":"VLOOKUP(C47,[1]辅助表!Y:Z,2,0)","v":2},134,223]
["橙色铠甲",10,"效果命中","橙色","铠甲",50,10,10,{"$f":"VLOOKUP(C48,[1]辅助表!Y:Z,2,0)","v":53},10,10]
["橙色铠甲",10,"效果抵抗","橙色","铠甲",50,10,10,{"$f":"VLOOKUP(C49,[1]辅助表!Y:Z,2,0)","v":54},10,10]
["橙色铠甲",10,"火抗（%）","橙色","铠甲",10,8,15,{"$f":"VLOOKUP(C50,[1]辅助表!Y:Z,2,0)","v":107},8,15]
["橙色铠甲",10,"风抗（%）","橙色","铠甲",10,8,15,{"$f":"VLOOKUP(C51,[1]辅助表!Y:Z,2,0)","v":108},8,15]
["橙色铠甲",10,"水抗（%）","橙色","铠甲",10,8,15,{"$f":"VLOOKUP(C52,[1]辅助表!Y:Z,2,0)","v":109},8,15]
["橙色铠甲",10,"地抗（%）","橙色","铠甲",10,8,15,{"$f":"VLOOKUP(C53,[1]辅助表!Y:Z,2,0)","v":110},8,15]
["橙色铠甲",10,"光抗（%）","橙色","铠甲",10,8,15,{"$f":"VLOOKUP(C54,[1]辅助表!Y:Z,2,0)","v":111},8,15]
["橙色铠甲",10,"暗抗（%）","橙色","铠甲",10,8,15,{"$f":"VLOOKUP(C55,[1]辅助表!Y:Z,2,0)","v":112},8,15]
["橙色鞋子",11,"生命","橙色","鞋子",24,{"$f":"2400*[1]辅助表!$AE$6*F56/100","v":1837.963636363637},{"$f":"G56/0.6","v":3063.2727272727284},{"$f":"VLOOKUP(C56,[1]辅助表!Y:Z,2,0)","v":1},1837,3063]
["橙色鞋子",11,"攻击","橙色","鞋子",19,{"$f":"200*[1]辅助表!$AE$6*F57/100","v":121.2545454545455},{"$f":"G57/0.6","v":202.09090909090915},{"$f":"VLOOKUP(C57,[1]辅助表!Y:Z,2,0)","v":2},121,202]
["橙色鞋子",11,"护甲","橙色","鞋子",10,{"$f":"200*[1]辅助表!$AE$6*F58/100","v":63.81818181818184},{"$f":"G58/0.6","v":106.3636363636364},{"$f":"VLOOKUP(C58,[1]辅助表!Y:Z,2,0)","v":3},63,106]
["橙色鞋子",11,"魔抗","橙色","鞋子",13,{"$f":"200*[1]辅助表!$AE$6*F59/100","v":82.96363636363638},{"$f":"G59/0.6","v":138.2727272727273},{"$f":"VLOOKUP(C59,[1]辅助表!Y:Z,2,0)","v":4},82,138]
["橙色鞋子",11,"暴击率","橙色","鞋子",23,5,5,{"$f":"VLOOKUP(C60,[1]辅助表!Y:Z,2,0)","v":55},5,5]
["橙色鞋子",11,"暴击伤害","橙色","鞋子",17,15,15,{"$f":"VLOOKUP(C61,[1]辅助表!Y:Z,2,0)","v":56},15,15]
["橙色鞋子",11,"火抗（%）","橙色","鞋子",15,5,5,{"$f":"VLOOKUP(C62,[1]辅助表!Y:Z,2,0)","v":107},5,5]
["橙色鞋子",11,"风抗（%）","橙色","鞋子",15,5,5,{"$f":"VLOOKUP(C63,[1]辅助表!Y:Z,2,0)","v":108},5,5]
["橙色鞋子",11,"水抗（%）","橙色","鞋子",15,5,5,{"$f":"VLOOKUP(C64,[1]辅助表!Y:Z,2,0)","v":109},5,5]
["橙色鞋子",11,"地抗（%）","橙色","鞋子",15,5,5,{"$f":"VLOOKUP(C65,[1]辅助表!Y:Z,2,0)","v":110},5,5]
["橙色鞋子",11,"光抗（%）","橙色","鞋子",15,5,5,{"$f":"VLOOKUP(C66,[1]辅助表!Y:Z,2,0)","v":111},5,5]
[{"$f":"D67&E67","v":"橙色鞋子"},11,"暗抗（%）","橙色","鞋子",15,5,5,{"$f":"VLOOKUP(C67,[1]辅助表!Y:Z,2,0)","v":112},5,5]
["橙色头饰",12,"护甲","橙色","头饰",28,5,5,{"$f":"VLOOKUP(C68,[1]辅助表!Y:Z,2,0)","v":3},5,5]
["橙色头饰",12,"魔抗","橙色","头饰",29,{"$f":"200*[1]辅助表!$AE$6*F69/100","v":185.07272727272732},{"$f":"G69/0.6","v":308.45454545454555},{"$f":"VLOOKUP(C69,[1]辅助表!Y:Z,2,0)","v":4},185,308]
["橙色头饰",12,"速度","橙色","头饰",21,{"$f":"176*[1]辅助表!$AG$6*F70/100","v":31.416},{"$f":"176*[1]辅助表!$AF$6*F70/100","v":36.96},{"$f":"VLOOKUP(C70,[1]辅助表!Y:Z,2,0)","v":5},31,36]
["橙色头饰",12,"暴击伤害","橙色","头饰",26,25,25,{"$f":"VLOOKUP(C71,[1]辅助表!Y:Z,2,0)","v":56},25,25]
["橙色头饰",12,"火攻（%）","橙色","头饰",10,5,10,{"$f":"VLOOKUP(C72,[1]辅助表!Y:Z,2,0)","v":101},5,10]
["橙色头饰",12,"风攻（%）","橙色","头饰",10,5,10,{"$f":"VLOOKUP(C73,[1]辅助表!Y:Z,2,0)","v":102},5,10]
["橙色头饰",12,"水攻（%）","橙色","头饰",10,5,10,{"$f":"VLOOKUP(C74,[1]辅助表!Y:Z,2,0)","v":103},5,10]
["橙色头饰",12,"地攻（%）","橙色","头饰",10,5,10,{"$f":"VLOOKUP(C75,[1]辅助表!Y:Z,2,0)","v":104},5,10]
["橙色头饰",12,"光攻（%）","橙色","头饰",10,5,10,{"$f":"VLOOKUP(C76,[1]辅助表!Y:Z,2,0)","v":105},5,10]
["橙色头饰",12,"暗攻（%）","橙色","头饰",10,5,10,{"$f":"VLOOKUP(C77,[1]辅助表!Y:Z,2,0)","v":106},5,10]

{"sheet":"Sheet2","index":2,"n_rows":90,"n_cols":9,"rows_kept":90}
[]
[]
[]
[]
[]
[]
[{"$nulls":4},7,3,null,{"$f":"E7*100","v":700},{"$f":"F7*100","v":300}]
[{"$nulls":4},7,3,null,{"$f":"E8*100","v":700},{"$f":"F8*100","v":300}]
[{"$nulls":4},7,3,null,700,300]
[{"$nulls":4},7,3,null,700,300]
[{"$nulls":4},5,3,null,500,300]
[{"$nulls":4},5,3,null,500,300]
[{"$nulls":4},14,6,null,1400,600]
[{"$nulls":4},14,6,null,1400,600]
[{"$nulls":4},14,6,null,1400,600]
[{"$nulls":4},14,6,null,1400,600]
[{"$nulls":4},14,6,null,1400,600]
[{"$nulls":4},3,1.8,null,300,180]
[{"$nulls":4},3,1.8,null,300,180]
[{"$nulls":4},12,7.2,null,1200,720]
[{"$nulls":4},12,7.2,null,1200,720]
[{"$nulls":4},7.5,4.5,null,750,450]
[{"$nulls":4},7.5,4.5,null,750,450]
[{"$nulls":4},6,3.6,null,600,360]
[{"$nulls":4},21,12.6,null,2100,1260]
[{"$nulls":4},4.5,2.7,null,450,270]
[{"$nulls":4},4.5,2.7,null,450,270]
[{"$nulls":4},18,10.8,null,1800,1080]
[{"$nulls":4},18,10.8,null,1800,1080]
[{"$nulls":4},1.5,0.9,null,150,90]
[{"$nulls":4},6,3.6,null,600,360]
[{"$nulls":4},2.5,1.5,null,250,150]
[{"$nulls":4},3,1.8,null,300,180]
[{"$nulls":4},12.5,7.5,null,1250,750]
[{"$nulls":4},12.5,7.5,null,1250,750]
[{"$nulls":4},12,7.2,null,1200,720]
[{"$nulls":4},42,25.2,null,4200,2520]
[{"$nulls":4},7.5,4.5,null,750,450]
[{"$nulls":4},7.5,4.5,null,750,450]
[{"$nulls":4},20,12,null,2000,1200]
[{"$nulls":4},7.5,4.5,null,750,450]
[{"$nulls":4},7.5,4.5,null,750,450]
[{"$nulls":4},20,12,null,2000,1200]
[{"$nulls":4},30,18,null,3000,1800]
[{"$nulls":4},30,18,null,3000,1800]
[{"$nulls":4},3,1.8,null,300,180]
[{"$nulls":4},12,7.2,null,1200,720]
[{"$nulls":4},5,3,null,500,300]
[{"$nulls":4},6,3.6,null,600,360]
[{"$nulls":4},5,3,null,500,300]
[{"$nulls":4},5,3,null,500,300]
[{"$nulls":4},5,3,null,500,300]
[{"$nulls":4},10,6,null,1000,600]
[{"$nulls":4},5,3,null,500,300]
[{"$nulls":4},10,6,null,1000,600]
[{"$nulls":4},10,6,null,1000,600]
[{"$nulls":4},5,3,null,500,300]
[{"$nulls":4},10,6,null,1000,600]
[{"$nulls":4},10,6,null,1000,600]
[{"$nulls":4},10,6,null,1000,600]
[{"$nulls":4},10,6,null,1000,600]
[{"$nulls":4},20,12,null,2000,1200]
[{"$nulls":4},10,6,null,1000,600]
[{"$nulls":4},10,6,null,1000,600]
[{"$nulls":4},10,6,null,1000,600]
[{"$nulls":4},20,12,null,2000,1200]
[{"$nulls":4},20,12,null,2000,1200]
[{"$nulls":4},10,6,null,1000,600]
[{"$nulls":4},10,6,null,1000,600]
[{"$nulls":4},18,11,null,1800,1100]
[{"$nulls":4},18,11,null,1800,1100]
[{"$nulls":4},12,7.2,null,{"$f":"E72*100","v":1200},{"$f":"F72*100","v":720}]
[{"$nulls":4},18,11,null,1800,1100]
[{"$nulls":4},12.5,7.5,null,1250,750]
[{"$nulls":4},12,7.2,null,1200,720]
[{"$nulls":4},42,25.2,null,4200,2520]
[{"$nulls":4},12.5,7.5,null,1250,750]
[{"$nulls":4},18,11,null,1800,1100]
[{"$nulls":4},18,11,null,1800,1100]
[{"$nulls":4},12,7.2,null,1200,720]
[{"$nulls":4},42,25.2,null,4200,2520]
[{"$nulls":4},12,7.2,null,1200,720]
[{"$nulls":4},18,11,null,1800,1100]
[{"$nulls":4},12,7.2,null,1200,720]
[{"$nulls":4},18,11,null,1800,1100]
[{"$nulls":4},12.5,7.5,null,1250,750]
[{"$nulls":4},18,11,null,1800,1100]
[{"$nulls":4},12.5,7.5,null,1250,750]
[{"$nulls":4},12.5,7.5,null,1250,750]
[{"$nulls":4},18,11,null,1800,1100]