{"text_format":"3","workbook":"xlsx","n_sheets":2,"sheets":["ArenaRobotConfig","Sheet1"],"not_rendered":{"defined_names":1},"read":"whole","date_system":"1900"}

{"sheet":"ArenaRobotConfig","index":0,"n_rows":264,"n_cols":11,"rows_kept":264}
[null,"Id","RobotName","RobotLevel","RobotScore","RoleId","RoleLv","DifferDemonsId","DifferDemonsLv","PoolId","Nouse"]
[null,"int","string","int","int","mut,int#int,1","int","mut,int#int,1","int","int","string"]
[null,4,4,4,4,4,4,4,4,4,0]
[null,"索引","机器人姓名","机器人玩家等级","机器人玩家积分","妖灵师列表","妖灵师对应等级","异妖列表","异妖阶级","所属库id","策划备注"]
["默认值",0,null,null,0,"null",0,"null",0]
["正确性校对"]
["校对值"]
[null,1,"微生哲远",9,960,"10064#10048#10053#10050#10054#10052",20,null,null,1]
[null,2,"长孙骏勇",9,985,"10047#10048#10053#10050#10059#10052",18,null,null,1]
[null,3,"夹谷骏家",8,963,"10047#10048#10049#10050#10051#10052",22,null,null,1]
[null,4,"闾丘帝晖",8,985,"10047#10048#10049#10050#10051#10052",18,null,null,1]
[null,5,"柳震荣",10,978,"10064#10048#10070#10050#10054#10052",21,null,null,1]
[null,6,"谷梁帝博",10,972,"10047#10048#10053#10050#10051#10052",21,null,null,1]
[null,7,"云濡驰",10,961,"10047#10048#10049#10050#10054#10052",19,null,null,1]
[null,8,"东郭骏家",9,954,"10047#10061#10053#10050#10054#10052",22,null,null,1]
[null,9,"卫运林",8,958,"10047#10048#10049#10050#10054#10052",19,null,null,1]
[null,10,"方濡驰",9,976,"10047#10048#10053#10066#10051#10052",20,null,null,1]
[null,11,"褚师逸芃",10,984,"10047#10048#10072#10050#10069#10052",22,null,null,1]
[null,12,"司空骏暄",9,978,"10047#10061#10053#10050#10054#10052",22,null,null,1]
[null,13,"钱濡初",8,985,"10047#10048#10049#10050#10054#10052",18,null,null,1]
[null,14,"南荣桂美",10,966,"10047#10057#10053#10050#10054#10060",21,null,null,1]
[null,15,"昌家祥",10,995,"10047#10048#10072#10050#10058#10052",21,null,null,1]
[null,16,"子书骏家",13,1010,"10047#10057#10053#10066#10054#10065",37,null,null,2]
[null,17,"皇甫濡驰",15,1001,"10047#10048#10049#10068#10069#10065",35,null,null,2]
[null,18,"史信轩",15,1016,"10047#10048#10053#10050#10069#10052",34,null,null,2]
[null,19,"宗政骞逸",14,1034,"10047#10048#10072#10067#10069#10052",33,null,null,2]
[null,20,"呼延佑骏",13,1031,"10047#10057#10049#10068#10069#10052",37,null,null,2]
[null,21,"濮阳歆岚",15,1016,"10062#10061#10070#10050#10051#10052",34,null,null,2]
[null,22,"郎炳天",12,1054,"10047#10061#10049#10050#10069#10060",36,null,null,2]
[null,23,"赵辰鸿",15,1038,"10064#10061#10053#10050#10059#10052",30,null,null,2]
[null,24,"漆雕妍雨",13,1012,"10047#10048#10071#10066#10054#10065",30,null,null,2]
[null,25,"姜晨星",14,1056,"10047#10061#10049#10068#10054#10060",37,null,null,2]
[null,26,"轩辕天辰",14,1059,"10064#10048#10071#10050#10058#10052",30,null,null,2]
[null,27,"独孤晨晓",15,1047,"10047#10061#10049#10068#10058#10052",36,null,null,2]
[null,28,"申屠成强",12,1004,"10047#10048#10071#10067#10058#10052",30,null,null,2]
[null,29,"孔嘉瑞",12,1007,"10047#10057#10049#10067#10054#10060",31,null,null,2]
[null,30,"奚睿振",14,1042,"10047#10057#10072#10050#10059#10052",36,null,null,2]
[null,31,"公仲禧轩",12,1008,"10047#10057#10072#10066#10054#10052",33,null,null,2]
[null,32,"仲孙锐辰",13,1038,"10047#10048#10072#10066#10069#10052",30,null,null,2]
[null,33,"贯丘驰振",14,1022,"10047#10061#10070#10050#10054#10060",35,null,null,2]
[null,34,"奚林爵",12,1056,"10047#10061#10049#10067#10069#10052",33,null,null,2]
[null,35,"南宫祯家",12,1056,"10047#10048#10070#10066#10069#10052",31,null,null,2]
[null,36,"端木寅康",15,1057,"10062#10048#10053#10050#10058#10060",37,null,null,2]
[null,37,"赵远杰",13,1032,"10062#10048#10049#10066#10058#10052",36,null,null,2]
[null,38,"西门彤岚",15,1006,"10062#10061#10049#10050#10054#10060",34,null,null,2]
[null,39,"俞钊康",14,1012,"10047#10061#10070#10050#10054#10065",35,null,null,2]
[null,40,"李骏暄",14,1016,"10047#10048#10071#10066#10051#10065",32,null,null,2]
[null,41,"酆璐凡",13,1059,"10064#10048#10053#10068#10051#10060",37,null,null,2]
[null,42,"拓跋博骏",13,1041,"10047#10048#10053#10067#10069#10063",34,null,null,2]
[null,43,"呼延锦烁",12,1043,"10047#10048#10070#10067#10054#10063",33,null,null,2]
[null,44,"公祖蔓辰",14,1008,"10047#10048#10070#10068#10059#10052",30,null,null,2]
[null,45,"南宫睿振",14,1031,"10062#10048#10049#10050#10058#10065",37,null,null,2]
[null,46,"子车炳成",22,1119,"10062#10007#10071#10066#10040#10065",45,null,null,3]
[null,47,"谢辰运",20,1074,"10064#10061#10038#10066#10030#10063",49,null,null,3]
[null,48,"水凡腾",21,1064,"10062#10061#10042#10023#10059#10065",49,null,null,3]
[null,49,"郑嘉瑞",25,1086,"10064#10057#10071#10029#10058#10032",49,null,null,3]
[null,50,"华荣谛",23,1087,"10064#10005#10072#10067#10040#10063",48,null,null,3]
[null,51,"许相如",23,1120,"10003#10061#10016#10066#10058#10063",45,null,null,3]
[null,52,"微生逸星",24,1094,"10064#10057#10070#10066#10013#10090",42,null,null,3]
[null,53,"葛濡初",25,1118,"10018#10061#10070#10012#10058#10065",47,null,null,3]
[null,54,"公门雪芙",25,1111,"10062#10057#10042#10067#10069#10046",50,null,null,3]
[null,55,"金运钊",21,1075,"10062#10057#10071#10043#10045#10063",47,null,null,3]
[null,56,"公山成辰",21,1061,"10062#10002#10071#10028#10059#10065",42,null,null,3]
[null,57,"水昭彤",25,1062,"10064#10057#10008#10068#10058#10032",44,null,null,3]
[null,58,"姜梁升",24,1080,"10019#10057#10071#10009#10059#10063",43,null,null,3]
[null,59,"呼延嘉瑞",21,1095,"10062#10061#10038#10068#10069#10026",48,null,null,3]
[null,60,"公仲祥远",25,1090,"10019#10057#10071#10029#10059#10065",44,null,null,3]
[null,61,"葛雨雅",20,1063,"10062#10010#10070#10067#10031#10060",49,null,null,3]
[null,62,"鲍辰祜",25,1102,"10064#10057#10004#10067#10059#10090",49,null,null,3]
[null,63,"王中树",20,1068,"10064#10057#10070#10068#10089#10014",44,null,null,3]
[null,64,"公坚烁梁",25,1063,"10018#10057#10070#10068#10069#10014",47,null,null,3]
[null,65,"公仪澄驰",21,1120,"10062#10087#10004#10066#10058#10063",48,null,null,3]
[null,66,"韦德杰",22,1084,"10019#10005#10071#10068#10069#10060",51,null,null,3]
[null,67,"柏馨美",23,1109,"10062#10057#10004#10067#10058#10090",48,null,null,3]
[null,68,"韦腾锟",23,1084,"10036#10057#10072#10068#10059#10033",51,null,null,3]
[null,69,"范振然",23,1061,"10062#10007#10070#10022#10059#10060",49,null,null,3]
[null,70,"任年骞",21,1114,"10018#10057#10072#10066#10045#10060",49,null,null,3]
[null,71,"鲍骞权",21,1066,"10006#10057#10070#10067#10058#10014",44,null,null,3]
[null,72,"卫辰韦",20,1120,"10062#10057#10016#10066#10058#10032",43,null,null,3]
[null,73,"邹良佑",24,1116,"10062#10057#10070#10009#10015#10060",46,null,null,3]
{"$rows_left_out":185}
{"sheet":"Sheet1","index":1,"n_rows":258,"n_cols":19,"rows_kept":258}
["id","等级","玩家等级","位置",1,2,3,4,5,6]
[1,{"$f":"VLOOKUP($A2,ArenaRobotConfig!$B:$G,6,TRUE)","v":20},{"$f":"VLOOKUP($A2,ArenaRobotConfig!$B:$G,3,TRUE)","v":9},"星级",4,3,3,3,3,3,null,10064,10048,10053,10050,10054,10052,null,{"$f":"L2&\"#\"&M2&\"#\"&N2&\"#\"&O2&\"#\"&P2&\"#\"&Q2","v":"10064#10048#10053#10050#10054#10052"}]
[2,{"$f":"VLOOKUP($A3,ArenaRobotConfig!$B:$G,6,TRUE)","v":18},{"$f":"VLOOKUP($A3,ArenaRobotConfig!$B:$G,3,TRUE)","v":9},null,3,3,3,3,4,3,null,10047,10048,10053,10050,10059,10052,null,{"$f":"L3&\"#\"&M3&\"#\"&N3&\"#\"&O3&\"#\"&P3&\"#\"&Q3","v":"10047#10048#10053#10050#10059#10052"}]
[3,{"$f":"VLOOKUP($A4,ArenaRobotConfig!$B:$G,6,TRUE)","v":22},{"$f":"VLOOKUP($A4,ArenaRobotConfig!$B:$G,3,TRUE)","v":8},null,3,3,3,3,3,3,null,10047,10048,10049,10050,10051,10052,null,"10047#10048#10049#10050#10051#10052"]
[4,{"$f":"VLOOKUP($A5,ArenaRobotConfig!$B:$G,6,TRUE)","v":18},{"$f":"VLOOKUP($A5,ArenaRobotConfig!$B:$G,3,TRUE)","v":8},null,3,3,3,3,3,3,null,10047,10048,10049,10050,10051,10052,null,"10047#10048#10049#10050#10051#10052"]
[5,{"$f":"VLOOKUP($A6,ArenaRobotConfig!$B:$G,6,TRUE)","v":21},{"$f":"VLOOKUP($A6,ArenaRobotConfig!$B:$G,3,TRUE)","v":10},null,4,3,4,3,3,3,null,10064,10048,10070,10050,10054,10052,null,"10064#10048#10070#10050#10054#10052"]
[6,{"$f":"VLOOKUP($A7,ArenaRobotConfig!$B:$G,6,TRUE)","v":21},{"$f":"VLOOKUP($A7,ArenaRobotConfig!$B:$G,3,TRUE)","v":10},null,3,3,3,3,3,3,null,10047,10048,10053,10050,10051,10052,null,"10047#10048#10053#10050#10051#10052"]
[7,{"$f":"VLOOKUP($A8,ArenaRobotConfig!$B:$G,6,TRUE)","v":19},{"$f":"VLOOKUP($A8,ArenaRobotConfig!$B:$G,3,TRUE)","v":10},null,3,3,3,3,3,3,null,10047,10048,10049,10050,10054,10052,null,"10047#10048#10049#10050#10054#10052"]
[8,{"$f":"VLOOKUP($A9,ArenaRobotConfig!$B:$G,6,TRUE)","v":22},{"$f":"VLOOKUP($A9,ArenaRobotConfig!$B:$G,3,TRUE)","v":9},null,3,4,3,3,3,3,null,10047,10061,10053,10050,10054,10052,null,"10047#10061#10053#10050#10054#10052"]
[9,{"$f":"VLOOKUP($A10,ArenaRobotConfig!$B:$G,6,TRUE)","v":19},{"$f":"VLOOKUP($A10,ArenaRobotConfig!$B:$G,3,TRUE)","v":8},null,3,3,3,3,3,3,null,10047,10048,10049,10050,10054,10052,null,"10047#10048#10049#10050#10054#10052"]
[10,{"$f":"VLOOKUP($A11,ArenaRobotConfig!$B:$G,6,TRUE)","v":20},{"$f":"VLOOKUP($A11,ArenaRobotConfig!$B:$G,3,TRUE)","v":9},null,3,3,3,4,3,3,null,10047,10048,10053,10066,10051,10052,null,"10047#10048#10053#10066#10051#10052"]
[11,{"$f":"VLOOKUP($A12,ArenaRobotConfig!$B:$G,6,TRUE)","v":22},{"$f":"VLOOKUP($A12,ArenaRobotConfig!$B:$G,3,TRUE)","v":10},null,3,3,4,3,4,3,null,10047,10048,10072,10050,10069,10052,null,"10047#10048#10072#10050#10069#10052"]
[12,{"$f":"VLOOKUP($A13,ArenaRobotConfig!$B:$G,6,TRUE)","v":22},{"$f":"VLOOKUP($A13,ArenaRobotConfig!$B:$G,3,TRUE)","v":9},null,3,4,3,3,3,3,null,10047,10061,10053,10050,10054,10052,null,"10047#10061#10053#10050#10054#10052"]
[13,{"$f":"VLOOKUP($A14,ArenaRobotConfig!$B:$G,6,TRUE)","v":18},{"$f":"VLOOKUP($A14,ArenaRobotConfig!$B:$G,3,TRUE)","v":8},null,3,3,3,3,3,3,null,10047,10048,10049,10050,10054,10052,null,"10047#10048#10049#10050#10054#10052"]
[14,{"$f":"VLOOKUP($A15,ArenaRobotConfig!$B:$G,6,TRUE)","v":21},{"$f":"VLOOKUP($A15,ArenaRobotConfig!$B:$G,3,TRUE)","v":10},null,3,4,3,3,3,4,null,10047,10057,10053,10050,10054,10060,null,"10047#10057#10053#10050#10054#10060"]
[15,{"$f":"VLOOKUP($A16,ArenaRobotConfig!$B:$G,6,TRUE)","v":21},{"$f":"VLOOKUP($A16,ArenaRobotConfig!$B:$G,3,TRUE)","v":10},null,3,3,4,3,4,3,null,10047,10048,10072,10050,10058,10052,null,"10047#10048#10072#10050#10058#10052"]
[16,{"$f":"VLOOKUP($A17,ArenaRobotConfig!$B:$G,6,TRUE)","v":37},{"$f":"VLOOKUP($A17,ArenaRobotConfig!$B:$G,3,TRUE)","v":13},null,3,4,3,4,3,4,null,10047,10057,10053,10066,10054,10065,null,"10047#10057#10053#10066#10054#10065"]
[17,{"$f":"VLOOKUP($A18,ArenaRobotConfig!$B:$G,6,TRUE)","v":35},{"$f":"VLOOKUP($A18,ArenaRobotConfig!$B:$G,3,TRUE)","v":15},null,3,3,3,4,4,4,null,10047,10048,10049,10068,10069,10065,null,"10047#10048#10049#10068#10069#10065"]
[18,{"$f":"VLOOKUP($A19,ArenaRobotConfig!$B:$G,6,TRUE)","v":34},{"$f":"VLOOKUP($A19,ArenaRobotConfig!$B:$G,3,TRUE)","v":15},null,3,3,3,3,4,3,null,10047,10048,10053,10050,10069,10052,null,"10047#10048#10053#10050#10069#10052"]
[19,{"$f":"VLOOKUP($A20,ArenaRobotConfig!$B:$G,6,TRUE)","v":33},{"$f":"VLOOKUP($A20,ArenaRobotConfig!$B:$G,3,TRUE)","v":14},null,3,3,4,4,4,3,null,10047,10048,10072,10067,10069,10052,null,"10047#10048#10072#10067#10069#10052"]
[20,{"$f":"VLOOKUP($A21,ArenaRobotConfig!$B:$G,6,TRUE)","v":37},{"$f":"VLOOKUP($A21,ArenaRobotConfig!$B:$G,3,TRUE)","v":13},null,3,4,3,4,4,3,null,10047,10057,10049,10068,10069,10052,null,"10047#10057#10049#10068#10069#10052"]
[21,{"$f":"VLOOKUP($A22,ArenaRobotConfig!$B:$G,6,TRUE)","v":34},{"$f":"VLOOKUP($A22,ArenaRobotConfig!$B:$G,3,TRUE)","v":15},null,4,4,4,3,3,3,null,10062,10061,10070,10050,10051,10052,null,"10062#10061#10070#10050#10051#10052"]
[22,{"$f":"VLOOKUP($A23,ArenaRobotConfig!$B:$G,6,TRUE)","v":36},{"$f":"VLOOKUP($A23,ArenaRobotConfig!$B:$G,3,TRUE)","v":12},null,3,4,3,3,4,4,null,10047,10061,10049,10050,10069,10060,null,"10047#10061#10049#10050#10069#10060"]
[23,{"$f":"VLOOKUP($A24,ArenaRobotConfig!$B:$G,6,TRUE)","v":30},{"$f":"VLOOKUP($A24,ArenaRobotConfig!$B:$G,3,TRUE)","v":15},null,4,4,3,3,4,3,null,10064,10061,10053,10050,10059,10052,null,"10064#10061#10053#10050#10059#10052"]
[24,{"$f":"VLOOKUP($A25,ArenaRobotConfig!$B:$G,6,TRUE)","v":30},{"$f":"VLOOKUP($A25,ArenaRobotConfig!$B:$G,3,TRUE)","v":13},null,3,3,4,4,3,4,null,10047,10048,10071,10066,10054,10065,null,"10047#10048#10071#10066#10054#10065"]
[25,{"$f":"VLOOKUP($A26,ArenaRobotConfig!$B:$G,6,TRUE)","v":37},{"$f":"VLOOKUP($A26,ArenaRobotConfig!$B:$G,3,TRUE)","v":14},null,3,4,3,4,3,4,null,10047,10061,10049,10068,10054,10060,null,"10047#10061#10049#10068#10054#10060"]
[26,{"$f":"VLOOKUP($A27,ArenaRobotConfig!$B:$G,6,TRUE)","v":30},{"$f":"VLOOKUP($A27,ArenaRobotConfig!$B:$G,3,TRUE)","v":14},null,4,3,4,3,4,3,null,10064,10048,10071,10050,10058,10052,null,"10064#10048#10071#10050#10058#10052"]
[27,{"$f":"VLOOKUP($A28,ArenaRobotConfig!$B:$G,6,TRUE)","v":36},{"$f":"VLOOKUP($A28,ArenaRobotConfig!$B:$G,3,TRUE)","v":15},null,3,4,3,4,4,3,null,10047,10061,10049,10068,10058,10052,null,"10047#10061#10049#10068#10058#10052"]
[28,{"$f":"VLOOKUP($A29,ArenaRobotConfig!$B:$G,6,TRUE)","v":30},{"$f":"VLOOKUP($A29,ArenaRobotConfig!$B:$G,3,TRUE)","v":12},null,3,3,4,4,4,3,null,10047,10048,10071,10067,10058,10052,null,"10047#10048#10071#10067#10058#10052"]
[29,{"$f":"VLOOKUP($A30,ArenaRobotConfig!$B:$G,6,TRUE)","v":31},{"$f":"VLOOKUP($A30,ArenaRobotConfig!$B:$G,3,TRUE)","v":12},null,3,4,3,4,3,4,null,10047,10057,10049,10067,10054,10060,null,"10047#10057#10049#10067#10054#10060"]
[30,{"$f":"VLOOKUP($A31,ArenaRobotConfig!$B:$G,6,TRUE)","v":36},{"$f":"VLOOKUP($A31,ArenaRobotConfig!$B:$G,3,TRUE)","v":14},null,3,4,4,3,4,3,null,10047,10057,10072,10050,10059,10052,null,"10047#10057#10072#10050#10059#10052"]
[31,{"$f":"VLOOKUP($A32,ArenaRobotConfig!$B:$G,6,TRUE)","v":33},{"$f":"VLOOKUP($A32,ArenaRobotConfig!$B:$G,3,TRUE)","v":12},null,3,4,4,4,3,3,null,10047,10057,10072,10066,10054,10052,null,"10047#10057#10072#10066#10054#10052"]
[32,{"$f":"VLOOKUP($A33,ArenaRobotConfig!$B:$G,6,TRUE)","v":30},{"$f":"VLOOKUP($A33,ArenaRobotConfig!$B:$G,3,TRUE)","v":13},null,3,3,4,4,4,3,null,10047,10048,10072,10066,10069,10052,null,"10047#10048#10072#10066#10069#10052"]
[33,{"$f":"VLOOKUP($A34,ArenaRobotConfig!$B:$G,6,TRUE)","v":35},{"$f":"VLOOKUP($A34,ArenaRobotConfig!$B:$G,3,TRUE)","v":14},null,3,4,4,3,3,4,null,10047,10061,10070,10050,10054,10060,null,"10047#10061#10070#10050#10054#10060"]
[34,{"$f":"VLOOKUP($A35,ArenaRobotConfig!$B:$G,6,TRUE)","v":33},{"$f":"VLOOKUP($A35,ArenaRobotConfig!$B:$G,3,TRUE)","v":12},null,3,4,3,4,4,3,null,10047,10061,10049,10067,10069,10052,null,"10047#10061#10049#10067#10069#10052"]
[35,{"$f":"VLOOKUP($A36,ArenaRobotConfig!$B:$G,6,TRUE)","v":31},{"$f":"VLOOKUP($A36,ArenaRobotConfig!$B:$G,3,TRUE)","v":12},null,3,3,4,4,4,3,null,10047,10048,10070,10066,10069,10052,null,"10047#10048#10070#10066#10069#10052"]
[36,{"$f":"VLOOKUP($A37,ArenaRobotConfig!$B:$G,6,TRUE)","v":37},{"$f":"VLOOKUP($A37,ArenaRobotConfig!$B:$G,3,TRUE)","v":15},null,4,3,3,3,4,4,null,10062,10048,10053,10050,10058,10060,null,"10062#10048#10053#10050#10058#10060"]
[37,{"$f":"VLOOKUP($A38,ArenaRobotConfig!$B:$G,6,TRUE)","v":36},{"$f":"VLOOKUP($A38,ArenaRobotConfig!$B:$G,3,TRUE)","v":13},null,4,3,3,4,4,3,null,10062,10048,10049,10066,10058,10052,null,"10062#10048#10049#10066#10058#10052"]
[38,{"$f":"VLOOKUP($A39,ArenaRobotConfig!$B:$G,6,TRUE)","v":34},{"$f":"VLOOKUP($A39,ArenaRobotConfig!$B:$G,3,TRUE)","v":15},null,4,4,3,3,3,4,null,10062,10061,10049,10050,10054,10060,null,"10062#10061#10049#10050#10054#10060"]
[39,{"$f":"VLOOKUP($A40,ArenaRobotConfig!$B:$G,6,TRUE)","v":35},{"$f":"VLOOKUP($A40,ArenaRobotConfig!$B:$G,3,TRUE)","v":14},null,3,4,4,3,3,4,null,10047,10061,10070,10050,10054,10065,null,"10047#10061#10070#10050#10054#10065"]
[40,{"$f":"VLOOKUP($A41,ArenaRobotConfig!$B:$G,6,TRUE)","v":32},{"$f":"VLOOKUP($A41,ArenaRobotConfig!$B:$G,3,TRUE)","v":14},null,3,3,4,4,3,4,null,10047,10048,10071,10066,10051,10065,null,"10047#10048#10071#10066#10051#10065"]
[41,{"$f":"VLOOKUP($A42,ArenaRobotConfig!$B:$G,6,TRUE)","v":37},{"$f":"VLOOKUP($A42,ArenaRobotConfig!$B:$G,3,TRUE)","v":13},null,4,3,3,4,3,4,null,10064,10048,10053,10068,10051,10060,null,"10064#10048#10053#10068#10051#10060"]
[42,{"$f":"VLOOKUP($A43,ArenaRobotConfig!$B:$G,6,TRUE)","v":34},{"$f":"VLOOKUP($A43,ArenaRobotConfig!$B:$G,3,TRUE)","v":13},null,3,3,3,4,4,4,null,10047,10048,10053,10067,10069,10063,null,"10047#10048#10053#10067#10069#10063"]
[43,{"$f":"VLOOKUP($A44,ArenaRobotConfig!$B:$G,6,TRUE)","v":33},{"$f":"VLOOKUP($A44,ArenaRobotConfig!$B:$G,3,TRUE)","v":12},null,3,3,4,4,3,4,null,10047,10048,10070,10067,10054,10063,null,"10047#10048#10070#10067#10054#10063"]
[44,{"$f":"VLOOKUP($A45,ArenaRobotConfig!$B:$G,6,TRUE)","v":30},{"$f":"VLOOKUP($A45,ArenaRobotConfig!$B:$G,3,TRUE)","v":14},null,3,3,4,4,4,3,null,10047,10048,10070,10068,10059,10052,null,"10047#10048#10070#10068#10059#10052"]
[45,{"$f":"VLOOKUP($A46,ArenaRobotConfig!$B:$G,6,TRUE)","v":37},{"$f":"VLOOKUP($A46,ArenaRobotConfig!$B:$G,3,TRUE)","v":14},null,4,3,3,3,4,4,null,10062,10048,10049,10050,10058,10065,null,"10062#10048#10049#10050#10058#10065"]
[46,{"$f":"VLOOKUP($A47,ArenaRobotConfig!$B:$G,6,TRUE)","v":45},{"$f":"VLOOKUP($A47,ArenaRobotConfig!$B:$G,3,TRUE)","v":22},null,4,5,4,4,5,4,null,10062,10007,10071,10066,10040,10065,null,"10062#10007#10071#10066#10040#10065"]
[47,{"$f":"VLOOKUP($A48,ArenaRobotConfig!$B:$G,6,TRUE)","v":49},{"$f":"VLOOKUP($A48,ArenaRobotConfig!$B:$G,3,TRUE)","v":20},null,4,4,5,4,5,4,null,10064,10061,10038,10066,10030,10063,null,"10064#10061#10038#10066#10030#10063"]
[48,{"$f":"VLOOKUP($A49,ArenaRobotConfig!$B:$G,6,TRUE)","v":49},{"$f":"VLOOKUP($A49,ArenaRobotConfig!$B:$G,3,TRUE)","v":21},null,4,4,5,5,4,4,null,10062,10061,10042,10023,10059,10065,null,"10062#10061#10042#10023#10059#10065"]
[49,{"$f":"VLOOKUP($A50,ArenaRobotConfig!$B:$G,6,TRUE)","v":49},{"$f":"VLOOKUP($A50,ArenaRobotConfig!$B:$G,3,TRUE)","v":25},null,4,4,4,5,4,5,null,10064,10057,10071,10029,10058,10032,null,"10064#10057#10071#10029#10058#10032"]
[50,{"$f":"VLOOKUP($A51,ArenaRobotConfig!$B:$G,6,TRUE)","v":48},{"$f":"VLOOKUP($A51,ArenaRobotConfig!$B:$G,3,TRUE)","v":23},null,4,5,4,4,5,4,null,10064,10005,10072,10067,10040,10063,null,"10064#10005#10072#10067#10040#10063"]
[51,{"$f":"VLOOKUP($A52,ArenaRobotConfig!$B:$G,6,TRUE)","v":45},{"$f":"VLOOKUP($A52,ArenaRobotConfig!$B:$G,3,TRUE)","v":23},null,5,4,5,4,4,4,null,10003,10061,10016,10066,10058,10063,null,"10003#10061#10016#10066#10058#10063"]
[52,{"$f":"VLOOKUP($A53,ArenaRobotConfig!$B:$G,6,TRUE)","v":42},{"$f":"VLOOKUP($A53,ArenaRobotConfig!$B:$G,3,TRUE)","v":24},null,4,4,4,4,5,5,null,10064,10057,10070,10066,10013,10090,null,"10064#10057#10070#10066#10013#10090"]
[53,{"$f":"VLOOKUP($A54,ArenaRobotConfig!$B:$G,6,TRUE)","v":47},{"$f":"VLOOKUP($A54,ArenaRobotConfig!$B:$G,3,TRUE)","v":25},null,5,4,4,5,4,4,null,10018,10061,10070,10012,10058,10065,null,"10018#10061#10070#10012#10058#10065"]
[54,{"$f":"VLOOKUP($A55,ArenaRobotConfig!$B:$G,6,TRUE)","v":50},{"$f":"VLOOKUP($A55,ArenaRobotConfig!$B:$G,3,TRUE)","v":25},null,4,4,5,4,4,5,null,10062,10057,10042,10067,10069,10046,null,"10062#10057#10042#10067#10069#10046"]
[55,{"$f":"VLOOKUP($A56,ArenaRobotConfig!$B:$G,6,TRUE)","v":47},{"$f":"VLOOKUP($A56,ArenaRobotConfig!$B:$G,3,TRUE)","v":21},null,4,4,4,5,5,4,null,10062,10057,10071,10043,10045,10063,null,"10062#10057#10071#10043#10045#10063"]
[56,{"$f":"VLOOKUP($A57,ArenaRobotConfig!$B:$G,6,TRUE)","v":42},{"$f":"VLOOKUP($A57,ArenaRobotConfig!$B:$G,3,TRUE)","v":21},null,4,5,4,5,4,4,null,10062,10002,10071,10028,10059,10065,null,"10062#10002#10071#10028#10059#10065"]
[57,{"$f":"VLOOKUP($A58,ArenaRobotConfig!$B:$G,6,TRUE)","v":44},{"$f":"VLOOKUP($A58,ArenaRobotConfig!$B:$G,3,TRUE)","v":25},null,4,4,5,4,4,5,null,10064,10057,10008,10068,10058,10032,null,"10064#10057#10008#10068#10058#10032"]
[58,{"$f":"VLOOKUP($A59,ArenaRobotConfig!$B:$G,6,TRUE)","v":43},{"$f":"VLOOKUP($A59,ArenaRobotConfig!$B:$G,3,TRUE)","v":24},null,5,4,4,5,4,4,null,10019,10057,10071,10009,10059,10063,null,"10019#10057#10071#10009#10059#10063"]
[59,{"$f":"VLOOKUP($A60,ArenaRobotConfig!$B:$G,6,TRUE)","v":48},{"$f":"VLOOKUP($A60,ArenaRobotConfig!$B:$G,3,TRUE)","v":21},null,4,4,5,4,4,5,null,10062,10061,10038,10068,10069,10026,null,"10062#10061#10038#10068#10069#10026"]
[60,{"$f":"VLOOKUP($A61,ArenaRobotConfig!$B:$G,6,TRUE)","v":44},{"$f":"VLOOKUP($A61,ArenaRobotConfig!$B:$G,3,TRUE)","v":25},null,5,4,4,5,4,4,null,10019,10057,10071,10029,10059,10065,null,"10019#10057#10071#10029#10059#10065"]
[61,{"$f":"VLOOKUP($A62,ArenaRobotConfig!$B:$G,6,TRUE)","v":49},{"$f":"VLOOKUP($A62,ArenaRobotConfig!$B:$G,3,TRUE)","v":20},null,4,5,4,4,5,4,null,10062,10010,10070,10067,10031,10060,null,"10062#10010#10070#10067#10031#10060"]
[62,{"$f":"VLOOKUP($A63,ArenaRobotConfig!$B:$G,6,TRUE)","v":49},{"$f":"VLOOKUP($A63,ArenaRobotConfig!$B:$G,3,TRUE)","v":25},null,4,4,5,4,4,5,null,10064,10057,10004,10067,10059,10090,null,"10064#10057#10004#10067#10059#10090"]
[63,{"$f":"VLOOKUP($A64,ArenaRobotConfig!$B:$G,6,TRUE)","v":44},{"$f":"VLOOKUP($A64,ArenaRobotConfig!$B:$G,3,TRUE)","v":20},null,4,4,4,4,5,5,null,10064,10057,10070,10068,10089,10014,null,"10064#10057#10070#10068#10089#10014"]
[64,{"$f":"VLOOKUP($A65,ArenaRobotConfig!$B:$G,6,TRUE)","v":47},{"$f":"VLOOKUP($A65,ArenaRobotConfig!$B:$G,3,TRUE)","v":25},null,5,4,4,4,4,5,null,10018,10057,10070,10068,10069,10014,null,"10018#10057#10070#10068#10069#10014"]
[65,{"$f":"VLOOKUP($A66,ArenaRobotConfig!$B:$G,6,TRUE)","v":48},{"$f":"VLOOKUP($A66,ArenaRobotConfig!$B:$G,3,TRUE)","v":21},null,4,5,5,4,4,4,null,10062,10087,10004,10066,10058,10063,null,"10062#10087#10004#10066#10058#10063"]
[66,{"$f":"VLOOKUP($A67,ArenaRobotConfig!$B:$G,6,TRUE)","v":51},{"$f":"VLOOKUP($A67,ArenaRobotConfig!$B:$G,3,TRUE)","v":22},null,5,5,4,4,4,4,null,10019,10005,10071,10068,10069,10060,null,{"$f":"L67&\"#\"&M67&\"#\"&N67&\"#\"&O67&\"#\"&P67&\"#\"&Q67","v":"10019#10005#10071#10068#10069#10060"}]
[67,{"$f":"VLOOKUP($A68,ArenaRobotConfig!$B:$G,6,TRUE)","v":48},{"$f":"VLOOKUP($A68,ArenaRobotConfig!$B:$G,3,TRUE)","v":23},null,4,4,5,4,4,5,null,10062,10057,10004,10067,10058,10090,null,"10062#10057#10004#10067#10058#10090"]
[68,{"$f":"VLOOKUP($A69,ArenaRobotConfig!$B:$G,6,TRUE)","v":51},{"$f":"VLOOKUP($A69,ArenaRobotConfig!$B:$G,3,TRUE)","v":23},null,5,4,4,4,4,5,null,10036,10057,10072,10068,10059,10033,null,"10036#10057#10072#10068#10059#10033"]
[69,{"$f":"VLOOKUP($A70,ArenaRobotConfig!$B:$G,6,TRUE)","v":49},{"$f":"VLOOKUP($A70,ArenaRobotConfig!$B:$G,3,TRUE)","v":23},null,4,5,4,5,4,4,null,10062,10007,10070,10022,10059,10060,null,"10062#10007#10070#10022#10059#10060"]
[70,{"$f":"VLOOKUP($A71,ArenaRobotConfig!$B:$G,6,TRUE)","v":49},{"$f":"VLOOKUP($A71,ArenaRobotConfig!$B:$G,3,TRUE)","v":21},null,5,4,4,4,5,4,null,10018,10057,10072,10066,10045,10060,null,"10018#10057#10072#10066#10045#10060"]
[71,{"$f":"VLOOKUP($A72,ArenaRobotConfig!$B:$G,6,TRUE)","v":44},{"$f":"VLOOKUP($A72,ArenaRobotConfig!$B:$G,3,TRUE)","v":21},null,5,4,4,4,4,5,null,10006,10057,10070,10067,10058,10014,null,"10006#10057#10070#10067#10058#10014"]
[72,{"$f":"VLOOKUP($A73,ArenaRobotConfig!$B:$G,6,TRUE)","v":43},{"$f":"VLOOKUP($A73,ArenaRobotConfig!$B:$G,3,TRUE)","v":20},null,4,4,5,4,4,5,null,10062,10057,10016,10066,10058,10032,null,"10062#10057#10016#10066#10058#10032"]
[73,{"$f":"VLOOKUP($A74,ArenaRobotConfig!$B:$G,6,TRUE)","v":46},{"$f":"VLOOKUP($A74,ArenaRobotConfig!$B:$G,3,TRUE)","v":24},null,4,4,4,5,5,4,null,10062,10057,10070,10009,10015,10060,null,"10062#10057#10070#10009#10015#10060"]
[74,{"$f":"VLOOKUP($A75,ArenaRobotConfig!$B:$G,6,TRUE)","v":51},{"$f":"VLOOKUP($A75,ArenaRobotConfig!$B:$G,3,TRUE)","v":24},null,4,4,5,4,4,5,null,10064,10061,10011,10068,10058,10014,null,"10064#10061#10011#10068#10058#10014"]
[75,{"$f":"VLOOKUP($A76,ArenaRobotConfig!$B:$G,6,TRUE)","v":46},{"$f":"VLOOKUP($A76,ArenaRobotConfig!$B:$G,3,TRUE)","v":24},null,4,5,4,5,4,4,null,10064,10010,10072,10012,10058,10060,null,"10064#10010#10072#10012#10058#10060"]
[76,{"$f":"VLOOKUP($A77,ArenaRobotConfig!$B:$G,6,TRUE)","v":63},{"$f":"VLOOKUP($A77,ArenaRobotConfig!$B:$G,3,TRUE)","v":33},null,5,5,4,5,5,5,null,10044,10002,10071,10029,10024,10026,null,"10044#10002#10071#10029#10024#10026"]
[77,{"$f":"VLOOKUP($A78,ArenaRobotConfig!$B:$G,6,TRUE)","v":60},{"$f":"VLOOKUP($A78,ArenaRobotConfig!$B:$G,3,TRUE)","v":33},null,5,5,5,5,4,5,null,10034,10007,10042,10088,10069,10027,null,"10034#10007#10042#10088#10069#10027"]
[78,{"$f":"VLOOKUP($A79,ArenaRobotConfig!$B:$G,6,TRUE)","v":63},{"$f":"VLOOKUP($A79,ArenaRobotConfig!$B:$G,3,TRUE)","v":34},null,5,5,5,5,5,4,null,10019,10007,10042,10009,10015,10063,null,"10019#10007#10042#10009#10015#10063"]
[79,{"$f":"VLOOKUP($A80,ArenaRobotConfig!$B:$G,6,TRUE)","v":63},{"$f":"VLOOKUP($A80,ArenaRobotConfig!$B:$G,3,TRUE)","v":35},null,5,5,4,5,5,5,null,10018,10010,10072,10039,10030,10090,null,"10018#10010#10072#10039#10030#10090"]
{"$rows_left_out":178}