{"text_format":"3","workbook":"xlsx","n_sheets":5,"sheets":["DifferDemonsConfig","辅助表","配件表","整体表","属性表"],"not_rendered":{"external_links":1},"read":"whole","date_system":"1900"}

{"sheet":"DifferDemonsConfig","index":0,"n_rows":17,"n_cols":14,"rows_kept":17}
[null,"Id","OpenRules","Name","Quality","Icon","LiveIcon","Scale","Position","Effect","AvatarResourceID","LockAvatarResourceID","ComonpentList","Aptitude"]
[null,"int","mut,int#int,2","string","int","int","int","float","mut,float#float,1","string","int","int","mut,int#int,1","int"]
[null,2,4,2,2,3,3,3,3,3,3,3,2,3]
[null,"ID","异妖开放条件","异妖名字","异妖资质","Icon头像资源ID\n","静态立绘资源id","异妖缩放值","位置","每个异妖都有不同的特效 这里填特效名字 字符串","立绘资源ID","未激活的时候的立绘Id","异妖配件列表","异妖资质"]
["默认值",0,"null",{"$f":"\"\"","v":""},null,0,{"$nulls":3},{"$f":"\"\"","v":""},0,0,"null","null"]
["正确性校对"]
["校对值"]
[null,1,null,"刀劳鬼",6,null,206,0.55,"0#50",{"$nulls":3},"6001#6002#6003",16]
[null,2,null,"蒸笼仔",6,null,201,0.6,"0#0",{"$nulls":3},"6004#6005#6006",16]
[null,3,null,"横公",6,null,203,0.55,"0#0",{"$nulls":3},"6007#6008#6009",16]
[null,4,null,"拘魂姬",6,null,202,0.7,"0#-30",{"$nulls":3},"6010#6011#6012",16]
[null,5,null,"火鼠",7,null,207,0.48,"100#100",{"$nulls":3},"6013#6014#6015#6016",17]
[null,6,null,"拦面叟",7,null,210,0.6,"0#80",{"$nulls":3},"6017#6018#6019#6020",17]
[null,7,null,"孙龙",7,null,204,0.9,"0#80",{"$nulls":3},"6021#6022#6023#6024",17]
[null,8,null,"陌刀",7,null,208,0.76,"20#120",{"$nulls":3},"6025#6026#6027#6028",17]
[null,9,null,"风狸",7,null,205,0.8,"80#100",{"$nulls":3},"6029#6030#6031#6032",17]
[null,10,null,"天麟",7,null,209,0.5,"0#120",{"$nulls":3},"6033#6034#6035#6036",18]

{"sheet":"辅助表","index":1,"n_rows":65,"n_cols":18,"rows_kept":65,"merged":[[10,0,10,2],[10,5,10,7],[19,0,19,4],[19,6,19,10],[19,13,19,17],[37,0,37,4],[37,6,37,10],[37,13,37,17],[53,0,53,4]]}
["异妖加成倍数",null,40,null,null,"异妖速度倍数",4.52]
[]
["生命",2400,{"$nulls":3},"速度",176]
["攻击",200]
["护甲",200]
["魔抗",200]
[]
[]
[]
["生命、攻击属性的分配设计"]
["攻击",{"$nulls":4},"生命"]
[null,"权重","占比",{"$nulls":3},"权重","占比"]
["紫色",1,{"$f":"B13/SUM($B$13:$B$14)*$C$1","v":8},null,null,"紫色",1,{"$f":"G13/SUM($B$13:$B$14)*$C$1*10","v":80}]
["橙色",4,{"$f":"B14/SUM($B$13:$B$14)*$C$1","v":32},null,null,"橙色",4,{"$f":"G14/SUM($B$13:$B$14)*$C$1*10","v":320}]
[]
[]
["紫色生命加成的配件个数",null,null,{"$f":"4*2","v":8}]
["紫色攻击加成的配件个数",null,null,{"$f":"4*2","v":8}]
[]
["生命属性",{"$nulls":5},"攻击属性",{"$nulls":6},"效果命中"]
{"$rows_left_out":46}
{"sheet":"配件表","index":2,"n_rows":321,"n_cols":28,"rows_kept":321}
["配件名称","配件id","阶级","消耗物品1","数量","消耗物品2","数量","输出1","输出2","消耗","属性1","数值","属性2","数值","属性3","数值","输出","异妖","品质"]
[{"$f":"\"配件\"&B2","v":"配件1"},1,1,6001,1,5,0,{"$f":"[1]!SUMSTRING(D2:E2,\"#\")","v":{"$error":"#NAME?"}},{"$f":"[1]!SUMSTRING(F2:G2,\"#\")","v":{"$error":"#NAME?"}},{"$f":"[1]!SUMSTRING(H2:I2,\"|\")","v":{"$error":"#NAME?"}},"生命",842,"攻击",7,null,null,{"$f":"IF(O2=\"\",VLOOKUP(K2,属性表!$H:$I,2,0)&\"#\"&配件表!L2&\"|\"&VLOOKUP(M2,属性表!$H:$I,2,0)&\"#\"&配件表!N2,VLOOKUP(K2,属性表!$H:$I,2,0)&\"#\"&配件表!L2&\"|\"&VLOOKUP(M2,属性表!$H:$I,2,0)&\"#\"&配件表!N2&\"|\"&VLOOKUP(O2,属性表!$H:$I,2,0)&\"#\"&配件表!P2)","v":"1#842|2#7"},{"$f":"VLOOKUP(B2,$Y:$Z,2,0)","v":"异妖1"},{"$f":"VLOOKUP(R2,$Z:$AA,2,0)","v":"紫色"},{"$nulls":5},1,"异妖1","紫色"]
[{"$f":"\"配件\"&B3","v":"配件1"},1,2,6001,1,5,40,{"$f":"[1]!SUMSTRING(D3:E3,\"#\")","v":{"$error":"#NAME?"}},{"$f":"[1]!SUMSTRING(F3:G3,\"#\")","v":{"$error":"#NAME?"}},{"$f":"[1]!SUMSTRING(H3:I3,\"|\")","v":{"$error":"#NAME?"}},"生命",2105,"攻击",17,null,null,{"$f":"IF(O3=\"\",VLOOKUP(K3,属性表!$H:$I,2,0)&\"#\"&配件表!L3&\"|\"&VLOOKUP(M3,属性表!$H:$I,2,0)&\"#\"&配件表!N3,VLOOKUP(K3,属性表!$H:$I,2,0)&\"#\"&配件表!L3&\"|\"&VLOOKUP(M3,属性表!$H:$I,2,0)&\"#\"&配件表!N3&\"|\"&VLOOKUP(O3,属性表!$H:$I,2,0)&\"#\"&配件表!P3)","v":"1#2105|2#17"},"异妖1","紫色",{"$nulls":5},2,"异妖1","紫色"]
["配件1",1,3,6001,2,5,65,{"$f":"[1]!SUMSTRING(D4:E4,\"#\")","v":{"$error":"#NAME?"}},{"$f":"[1]!SUMSTRING(F4:G4,\"#\")","v":{"$error":"#NAME?"}},{"$f":"[1]!SUMSTRING(H4:I4,\"|\")","v":{"$error":"#NAME?"}},"生命",3368,"攻击",28,null,null,{"$f":"IF(O4=\"\",VLOOKUP(K4,属性表!$H:$I,2,0)&\"#\"&配件表!L4&\"|\"&VLOOKUP(M4,属性表!$H:$I,2,0)&\"#\"&配件表!N4,VLOOKUP(K4,属性表!$H:$I,2,0)&\"#\"&配件表!L4&\"|\"&VLOOKUP(M4,属性表!$H:$I,2,0)&\"#\"&配件表!N4&\"|\"&VLOOKUP(O4,属性表!$H:$I,2,0)&\"#\"&配件表!P4)","v":"1#3368|2#28"},"异妖1","紫色",{"$nulls":5},3,"异妖1","紫色",{"$f":"[1]!SUMSTRING(Y2:Y4,\"#\")","v":{"$error":"#NAME?"}}]
["配件1",1,4,6001,2,5,100,{"$f":"[1]!SUMSTRING(D5:E5,\"#\")","v":{"$error":"#NAME?"}},{"$f":"[1]!SUMSTRING(F5:G5,\"#\")","v":{"$error":"#NAME?"}},{"$f":"[1]!SUMSTRING(H5:I5,\"|\")","v":{"$error":"#NAME?"}},"生命",5052,"攻击",42,null,null,{"$f":"IF(O5=\"\",VLOOKUP(K5,属性表!$H:$I,2,0)&\"#\"&配件表!L5&\"|\"&VLOOKUP(M5,属性表!$H:$I,2,0)&\"#\"&配件表!N5,VLOOKUP(K5,属性表!$H:$I,2,0)&\"#\"&配件表!L5&\"|\"&VLOOKUP(M5,属性表!$H:$I,2,0)&\"#\"&配件表!N5&\"|\"&VLOOKUP(O5,属性表!$H:$I,2,0)&\"#\"&配件表!P5)","v":"1#5052|2#42"},"异妖1","紫色",{"$nulls":5},4,{"$f":"\"异妖\"&CEILING(Y5/3,1)","v":"异妖2"},"紫色"]
["配件1",1,5,6001,3,5,135,{"$f":"[1]!SUMSTRING(D6:E6,\"#\")","v":{"$error":"#NAME?"}},{"$f":"[1]!SUMSTRING(F6:G6,\"#\")","v":{"$error":"#NAME?"}},{"$f":"[1]!SUMSTRING(H6:I6,\"|\")","v":{"$error":"#NAME?"}},"生命",7157,"攻击",59,null,null,{"$f":"IF(O6=\"\",VLOOKUP(K6,属性表!$H:$I,2,0)&\"#\"&配件表!L6&\"|\"&VLOOKUP(M6,属性表!$H:$I,2,0)&\"#\"&配件表!N6,VLOOKUP(K6,属性表!$H:$I,2,0)&\"#\"&配件表!L6&\"|\"&VLOOKUP(M6,属性表!$H:$I,2,0)&\"#\"&配件表!N6&\"|\"&VLOOKUP(O6,属性表!$H:$I,2,0)&\"#\"&配件表!P6)","v":"1#7157|2#59"},"异妖1","紫色",{"$nulls":5},5,{"$f":"\"异妖\"&CEILING(Y6/3,1)","v":"异妖2"},"紫色"]
["配件1",1,6,6001,3,5,180,{"$f":"[1]!SUMSTRING(D7:E7,\"#\")","v":{"$error":"#NAME?"}},{"$f":"[1]!SUMSTRING(F7:G7,\"#\")","v":{"$error":"#NAME?"}},{"$f":"[1]!SUMSTRING(H7:I7,\"|\")","v":{"$error":"#NAME?"}},"生命",9684,"攻击",80,null,null,{"$f":"IF(O7=\"\",VLOOKUP(K7,属性表!$H:$I,2,0)&\"#\"&配件表!L7&\"|\"&VLOOKUP(M7,属性表!$H:$I,2,0)&\"#\"&配件表!N7,VLOOKUP(K7,属性表!$H:$I,2,0)&\"#\"&配件表!L7&\"|\"&VLOOKUP(M7,属性表!$H:$I,2,0)&\"#\"&配件表!N7&\"|\"&VLOOKUP(O7,属性表!$H:$I,2,0)&\"#\"&配件表!P7)","v":"1#9684|2#80"},"异妖1","紫色",{"$nulls":5},6,"异妖2","紫色",{"$f":"[1]!SUMSTRING(Y5:Y7,\"#\")","v":{"$error":"#NAME?"}}]
["配件1",1,7,6001,4,5,235,{"$f":"[1]!SUMSTRING(D8:E8,\"#\")","v":{"$error":"#NAME?"}},{"$f":"[1]!SUMSTRING(F8:G8,\"#\")","v":{"$error":"#NAME?"}},{"$f":"[1]!SUMSTRING(H8:I8,\"|\")","v":{"$error":"#NAME?"}},"生命",12631,"攻击",105,null,null,{"$f":"IF(O8=\"\",VLOOKUP(K8,属性表!$H:$I,2,0)&\"#\"&配件表!L8&\"|\"&VLOOKUP(M8,属性表!$H:$I,2,0)&\"#\"&配件表!N8,VLOOKUP(K8,属性表!$H:$I,2,0)&\"#\"&配件表!L8&\"|\"&VLOOKUP(M8,属性表!$H:$I,2,0)&\"#\"&配件表!N8&\"|\"&VLOOKUP(O8,属性表!$H:$I,2,0)&\"#\"&配件表!P8)","v":"1#12631|2#105"},"异妖1","紫色",{"$nulls":5},7,"异妖3","紫色"]
["配件1",1,8,6001,5,5,290,{"$f":"[1]!SUMSTRING(D9:E9,\"#\")","v":{"$error":"#NAME?"}},{"$f":"[1]!SUMSTRING(F9:G9,\"#\")","v":{"$error":"#NAME?"}},{"$f":"[1]!SUMSTRING(H9:I9,\"|\")","v":{"$error":"#NAME?"}},"生命",16000,"攻击",133,null,null,{"$f":"IF(O9=\"\",VLOOKUP(K9,属性表!$H:$I,2,0)&\"#\"&配件表!L9&\"|\"&VLOOKUP(M9,属性表!$H:$I,2,0)&\"#\"&配件表!N9,VLOOKUP(K9,属性表!$H:$I,2,0)&\"#\"&配件表!L9&\"|\"&VLOOKUP(M9,属性表!$H:$I,2,0)&\"#\"&配件表!N9&\"|\"&VLOOKUP(O9,属性表!$H:$I,2,0)&\"#\"&配件表!P9)","v":"1#16000|2#133"},"异妖1","紫色",{"$nulls":5},8,"异妖3","紫色"]
["配件1",1,9,6001,6,5,355,{"$f":"[1]!SUMSTRING(D10:E10,\"#\")","v":{"$error":"#NAME?"}},{"$f":"[1]!SUMSTRING(F10:G10,\"#\")","v":{"$error":"#NAME?"}},{"$f":"[1]!SUMSTRING(H10:I10,\"|\")","v":{"$error":"#NAME?"}},"生命",19789,"攻击",164,null,null,{"$f":"IF(O10=\"\",VLOOKUP(K10,属性表!$H:$I,2,0)&\"#\"&配件表!L10&\"|\"&VLOOKUP(M10,属性表!$H:$I,2,0)&\"#\"&配件表!N10,VLOOKUP(K10,属性表!$H:$I,2,0)&\"#\"&配件表!L10&\"|\"&VLOOKUP(M10,属性表!$H:$I,2,0)&\"#\"&配件表!N10&\"|\"&VLOOKUP(O10,属性表!$H:$I,2,0)&\"#\"&配件表!P10)","v":"1#19789|2#164"},"异妖1","紫色",{"$nulls":5},9,"异妖3","紫色",{"$f":"[1]!SUMSTRING(Y8:Y10,\"#\")","v":{"$error":"#NAME?"}}]
["配件1",1,10,6001,8,5,420,{"$f":"[1]!SUMSTRING(D11:E11,\"#\")","v":{"$error":"#NAME?"}},{"$f":"[1]!SUMSTRING(F11:G11,\"#\")","v":{"$error":"#NAME?"}},{"$f":"[1]!SUMSTRING(H11:I11,\"|\")","v":{"$error":"#NAME?"}},"生命",24000,"攻击",200,null,null,{"$f":"IF(O11=\"\",VLOOKUP(K11,属性表!$H:$I,2,0)&\"#\"&配件表!L11&\"|\"&VLOOKUP(M11,属性表!$H:$I,2,0)&\"#\"&配件表!N11,VLOOKUP(K11,属性表!$H:$I,2,0)&\"#\"&配件表!L11&\"|\"&VLOOKUP(M11,属性表!$H:$I,2,0)&\"#\"&配件表!N11&\"|\"&VLOOKUP(O11,属性表!$H:$I,2,0)&\"#\"&配件表!P11)","v":"1#24000|2#200"},"异妖1","紫色",{"$nulls":5},10,"异妖4","紫色"]
["配件2",{"$f":"B2+1","v":2},{"$f":"C2","v":1},{"$f":"D2+1","v":6002},{"$f":"E2","v":1},{"$f":"F2","v":5},{"$f":"G2","v":0},{"$f":"[1]!SUMSTRING(D12:E12,\"#\")","v":{"$error":"#NAME?"}},{"$f":"[1]!SUMSTRING(F12:G12,\"#\")","v":{"$error":"#NAME?"}},{"$f":"[1]!SUMSTRING(H12:I12,\"|\")","v":{"$error":"#NAME?"}},"生命",842,"护甲",{"$f":"N2*5","v":35},null,null,{"$f":"IF(O12=\"\",VLOOKUP(K12,属性表!$H:$I,2,0)&\"#\"&配件表!L12&\"|\"&VLOOKUP(M12,属性表!$H:$I,2,0)&\"#\"&配件表!N12,VLOOKUP(K12,属性表!$H:$I,2,0)&\"#\"&配件表!L12&\"|\"&VLOOKUP(M12,属性表!$H:$I,2,0)&\"#\"&配件表!N12&\"|\"&VLOOKUP(O12,属性表!$H:$I,2,0)&\"#\"&配件表!P12)","v":"1#842|3#35"},"异妖1","紫色",{"$nulls":5},11,"异妖4","紫色"]
["配件2",{"$f":"B3+1","v":2},{"$f":"C3","v":2},{"$f":"D3+1","v":6002},{"$f":"E3","v":1},5,40,{"$f":"[1]!SUMSTRING(D13:E13,\"#\")","v":{"$error":"#NAME?"}},{"$f":"[1]!SUMSTRING(F13:G13,\"#\")","v":{"$error":"#NAME?"}},{"$f":"[1]!SUMSTRING(H13:I13,\"|\")","v":{"$error":"#NAME?"}},"生命",2105,"护甲",{"$f":"N3*5","v":85},null,null,{"$f":"IF(O13=\"\",VLOOKUP(K13,属性表!$H:$I,2,0)&\"#\"&配件表!L13&\"|\"&VLOOKUP(M13,属性表!$H:$I,2,0)&\"#\"&配件表!N13,VLOOKUP(K13,属性表!$H:$I,2,0)&\"#\"&配件表!L13&\"|\"&VLOOKUP(M13,属性表!$H:$I,2,0)&\"#\"&配件表!N13&\"|\"&VLOOKUP(O13,属性表!$H:$I,2,0)&\"#\"&配件表!P13)","v":"1#2105|3#85"},"异妖1","紫色",{"$nulls":5},12,"异妖4","紫色",{"$f":"[1]!SUMSTRING(Y11:Y13,\"#\")","v":{"$error":"#NAME?"}}]
["配件2",2,3,6002,{"$f":"E4","v":2},5,65,{"$f":"[1]!SUMSTRING(D14:E14,\"#\")","v":{"$error":"#NAME?"}},{"$f":"[1]!SUMSTRING(F14:G14,\"#\")","v":{"$error":"#NAME?"}},{"$f":"[1]!SUMSTRING(H14:I14,\"|\")","v":{"$error":"#NAME?"}},"生命",3368,"护甲",140,null,null,{"$f":"IF(O14=\"\",VLOOKUP(K14,属性表!$H:$I,2,0)&\"#\"&配件表!L14&\"|\"&VLOOKUP(M14,属性表!$H:$I,2,0)&\"#\"&配件表!N14,VLOOKUP(K14,属性表!$H:$I,2,0)&\"#\"&配件表!L14&\"|\"&VLOOKUP(M14,属性表!$H:$I,2,0)&\"#\"&配件表!N14&\"|\"&VLOOKUP(O14,属性表!$H:$I,2,0)&\"#\"&配件表!P14)","v":"1#3368|3#140"},"异妖1","紫色",{"$nulls":5},13,{"$f":"\"异妖\"&CEILING(Y14/4,1)+1","v":"异妖5"},"橙色"]
["配件2",2,4,6002,{"$f":"E5","v":2},5,100,{"$f":"[1]!SUMSTRING(D15:E15,\"#\")","v":{"$error":"#NAME?"}},{"$f":"[1]!SUMSTRING(F15:G15,\"#\")","v":{"$error":"#NAME?"}},{"$f":"[1]!SUMSTRING(H15:I15,\"|\")","v":{"$error":"#NAME?"}},"生命",5052,"护甲",210,null,null,{"$f":"IF(O15=\"\",VLOOKUP(K15,属性表!$H:$I,2,0)&\"#\"&配件表!L15&\"|\"&VLOOKUP(M15,属性表!$H:$I,2,0)&\"#\"&配件表!N15,VLOOKUP(K15,属性表!$H:$I,2,0)&\"#\"&配件表!L15&\"|\"&VLOOKUP(M15,属性表!$H:$I,2,0)&\"#\"&配件表!N15&\"|\"&VLOOKUP(O15,属性表!$H:$I,2,0)&\"#\"&配件表!P15)","v":"1#5052|3#210"},"异妖1","紫色",{"$nulls":5},14,{"$f":"\"异妖\"&CEILING(Y15/4,1)+1","v":"异妖5"},"橙色"]
["配件2",2,5,6002,{"$f":"E6","v":3},5,135,{"$f":"[1]!SUMSTRING(D16:E16,\"#\")","v":{"$error":"#NAME?"}},{"$f":"[1]!SUMSTRING(F16:G16,\"#\")","v":{"$error":"#NAME?"}},{"$f":"[1]!SUMSTRING(H16:I16,\"|\")","v":{"$error":"#NAME?"}},"生命",7157,"护甲",295,null,null,{"$f":"IF(O16=\"\",VLOOKUP(K16,属性表!$H:$I,2,0)&\"#\"&配件表!L16&\"|\"&VLOOKUP(M16,属性表!$H:$I,2,0)&\"#\"&配件表!N16,VLOOKUP(K16,属性表!$H:$I,2,0)&\"#\"&配件表!L16&\"|\"&VLOOKUP(M16,属性表!$H:$I,2,0)&\"#\"&配件表!N16&\"|\"&VLOOKUP(O16,属性表!$H:$I,2,0)&\"#\"&配件表!P16)","v":"1#7157|3#295"},"异妖1","紫色",{"$nulls":5},15,"异妖5","橙色"]
["配件2",2,6,6002,{"$f":"E7","v":3},5,180,{"$f":"[1]!SUMSTRING(D17:E17,\"#\")","v":{"$error":"#NAME?"}},{"$f":"[1]!SUMSTRING(F17:G17,\"#\")","v":{"$error":"#NAME?"}},{"$f":"[1]!SUMSTRING(H17:I17,\"|\")","v":{"$error":"#NAME?"}},"生命",9684,"护甲",400,null,null,{"$f":"IF(O17=\"\",VLOOKUP(K17,属性表!$H:$I,2,0)&\"#\"&配件表!L17&\"|\"&VLOOKUP(M17,属性表!$H:$I,2,0)&\"#\"&配件表!N17,VLOOKUP(K17,属性表!$H:$I,2,0)&\"#\"&配件表!L17&\"|\"&VLOOKUP(M17,属性表!$H:$I,2,0)&\"#\"&配件表!N17&\"|\"&VLOOKUP(O17,属性表!$H:$I,2,0)&\"#\"&配件表!P17)","v":"1#9684|3#400"},"异妖1","紫色",{"$nulls":5},16,"异妖5","橙色",{"$f":"[1]!SUMSTRING(Y14:Y17,\"#\")","v":{"$error":"#NAME?"}}]
["配件2",2,7,6002,{"$f":"E8","v":4},5,235,{"$f":"[1]!SUMSTRING(D18:E18,\"#\")","v":{"$error":"#NAME?"}},{"$f":"[1]!SUMSTRING(F18:G18,\"#\")","v":{"$error":"#NAME?"}},{"$f":"[1]!SUMSTRING(H18:I18,\"|\")","v":{"$error":"#NAME?"}},"生命",12631,"护甲",525,null,null,{"$f":"IF(O18=\"\",VLOOKUP(K18,属性表!$H:$I,2,0)&\"#\"&配件表!L18&\"|\"&VLOOKUP(M18,属性表!$H:$I,2,0)&\"#\"&配件表!N18,VLOOKUP(K18,属性表!$H:$I,2,0)&\"#\"&配件表!L18&\"|\"&VLOOKUP(M18,属性表!$H:$I,2,0)&\"#\"&配件表!N18&\"|\"&VLOOKUP(O18,属性表!$H:$I,2,0)&\"#\"&配件表!P18)","v":"1#12631|3#525"},"异妖1","紫色",{"$nulls":5},17,"异妖6","橙色"]
["配件2",2,8,6002,{"$f":"E9","v":5},5,290,{"$f":"[1]!SUMSTRING(D19:E19,\"#\")","v":{"$error":"#NAME?"}},{"$f":"[1]!SUMSTRING(F19:G19,\"#\")","v":{"$error":"#NAME?"}},{"$f":"[1]!SUMSTRING(H19:I19,\"|\")","v":{"$error":"#NAME?"}},"生命",16000,"护甲",665,null,null,{"$f":"IF(O19=\"\",VLOOKUP(K19,属性表!$H:$I,2,0)&\"#\"&配件表!L19&\"|\"&VLOOKUP(M19,属性表!$H:$I,2,0)&\"#\"&配件表!N19,VLOOKUP(K19,属性表!$H:$I,2,0)&\"#\"&配件表!L19&\"|\"&VLOOKUP(M19,属性表!$H:$I,2,0)&\"#\"&配件表!N19&\"|\"&VLOOKUP(O19,属性表!$H:$I,2,0)&\"#\"&配件表!P19)","v":"1#16000|3#665"},"异妖1","紫色",{"$nulls":5},18,"异妖6","橙色"]
["配件2",2,9,6002,{"$f":"E10","v":6},5,355,{"$f":"[1]!SUMSTRING(D20:E20,\"#\")","v":{"$error":"#NAME?"}},{"$f":"[1]!SUMSTRING(F20:G20,\"#\")","v":{"$error":"#NAME?"}},{"$f":"[1]!SUMSTRING(H20:I20,\"|\")","v":{"$error":"#NAME?"}},"生命",19789,"护甲",820,null,null,{"$f":"IF(O20=\"\",VLOOKUP(K20,属性表!$H:$I,2,0)&\"#\"&配件表!L20&\"|\"&VLOOKUP(M20,属性表!$H:$I,2,0)&\"#\"&配件表!N20,VLOOKUP(K20,属性表!$H:$I,2,0)&\"#\"&配件表!L20&\"|\"&VLOOKUP(M20,属性表!$H:$I,2,0)&\"#\"&配件表!N20&\"|\"&VLOOKUP(O20,属性表!$H:$I,2,0)&\"#\"&配件表!P20)","v":"1#19789|3#820"},"异妖1","紫色",{"$nulls":5},19,"异妖6","橙色"]
{"$rows_left_out":302}
{"sheet":"整体表","index":3,"n_rows":101,"n_cols":11,"rows_kept":101}
[null,null,"异妖id",null,null,"消耗1","数量","消耗2","数量","消耗输出","前置条件"]
[null,null,1,"01",{"$f":"C2&D2","v":"101"},5,240,6,1,{"$f":"[1]!SUMSTRING(F2:G2,\"#\")&\"|\"&[1]!SUMSTRING(H2:I2,\"#\")","v":{"$error":"#NAME?"}},1]
[null,null,1,"02",{"$f":"C3&D3","v":"102"},5,360,6,1,{"$f":"[1]!SUMSTRING(F3:G3,\"#\")&\"|\"&[1]!SUMSTRING(H3:I3,\"#\")","v":{"$error":"#NAME?"}},2]
[null,null,1,"03","103",5,480,6,2,{"$f":"[1]!SUMSTRING(F4:G4,\"#\")&\"|\"&[1]!SUMSTRING(H4:I4,\"#\")","v":{"$error":"#NAME?"}},3]
[null,null,1,"04","104",5,600,6,2,{"$f":"[1]!SUMSTRING(F5:G5,\"#\")&\"|\"&[1]!SUMSTRING(H5:I5,\"#\")","v":{"$error":"#NAME?"}},4]
[null,null,1,"05","105",5,720,6,3,{"$f":"[1]!SUMSTRING(F6:G6,\"#\")&\"|\"&[1]!SUMSTRING(H6:I6,\"#\")","v":{"$error":"#NAME?"}},5]
[null,null,1,"06","106",5,840,6,3,{"$f":"[1]!SUMSTRING(F7:G7,\"#\")&\"|\"&[1]!SUMSTRING(H7:I7,\"#\")","v":{"$error":"#NAME?"}},7]
[null,null,1,"07","107",5,960,6,4,{"$f":"[1]!SUMSTRING(F8:G8,\"#\")&\"|\"&[1]!SUMSTRING(H8:I8,\"#\")","v":{"$error":"#NAME?"}},8]
[null,null,1,"08","108",5,1080,6,5,{"$f":"[1]!SUMSTRING(F9:G9,\"#\")&\"|\"&[1]!SUMSTRING(H9:I9,\"#\")","v":{"$error":"#NAME?"}},9]
[null,null,1,"09","109",5,1200,6,8,{"$f":"[1]!SUMSTRING(F10:G10,\"#\")&\"|\"&[1]!SUMSTRING(H10:I10,\"#\")","v":{"$error":"#NAME?"}},10]
[null,null,1,"10","110",5,1320,6,11,{"$f":"[1]!SUMSTRING(F11:G11,\"#\")&\"|\"&[1]!SUMSTRING(H11:I11,\"#\")","v":{"$error":"#NAME?"}}]
[null,null,{"$f":"C2+1","v":2},{"$f":"D2","v":"01"},"201",5,240,6,1,{"$f":"[1]!SUMSTRING(F12:G12,\"#\")&\"|\"&[1]!SUMSTRING(H12:I12,\"#\")","v":{"$error":"#NAME?"}},1]
[null,null,{"$f":"C3+1","v":2},{"$f":"D3","v":"02"},"202",5,360,6,1,{"$f":"[1]!SUMSTRING(F13:G13,\"#\")&\"|\"&[1]!SUMSTRING(H13:I13,\"#\")","v":{"$error":"#NAME?"}},2]
[null,null,2,"03","203",5,480,6,2,{"$f":"[1]!SUMSTRING(F14:G14,\"#\")&\"|\"&[1]!SUMSTRING(H14:I14,\"#\")","v":{"$error":"#NAME?"}},3]
[null,null,2,"04","204",5,600,6,2,{"$f":"[1]!SUMSTRING(F15:G15,\"#\")&\"|\"&[1]!SUMSTRING(H15:I15,\"#\")","v":{"$error":"#NAME?"}},4]
[null,null,2,"05","205",5,720,6,3,{"$f":"[1]!SUMSTRING(F16:G16,\"#\")&\"|\"&[1]!SUMSTRING(H16:I16,\"#\")","v":{"$error":"#NAME?"}},5]
[null,null,2,"06","206",5,840,6,3,{"$f":"[1]!SUMSTRING(F17:G17,\"#\")&\"|\"&[1]!SUMSTRING(H17:I17,\"#\")","v":{"$error":"#NAME?"}},7]
[null,null,2,"07","207",5,960,6,4,{"$f":"[1]!SUMSTRING(F18:G18,\"#\")&\"|\"&[1]!SUMSTRING(H18:I18,\"#\")","v":{"$error":"#NAME?"}},8]
[null,null,2,"08","208",5,1080,6,5,{"$f":"[1]!SUMSTRING(F19:G19,\"#\")&\"|\"&[1]!SUMSTRING(H19:I19,\"#\")","v":{"$error":"#NAME?"}},9]
[null,null,2,"09","209",5,1200,6,8,{"$f":"[1]!SUMSTRING(F20:G20,\"#\")&\"|\"&[1]!SUMSTRING(H20:I20,\"#\")","v":{"$error":"#NAME?"}},10]
{"$rows_left_out":82}
{"sheet":"属性表","index":4,"n_rows":30,"n_cols":10,"rows_kept":30}
[]
[]
[]
[]
[{"$nulls":7},"生命",1,"Hp"]
[{"$nulls":7},"攻击",2,"Attack"]
[{"$nulls":7},"护甲",3,"PhysicalDefence"]
[{"$nulls":7},"魔抗",4,"MagicDefence"]
[{"$nulls":7},"速度",5,"Speed"]
[{"$nulls":7},"生命上限",6]
[{"$nulls":7},"伤害加成百分比",51,"DamageBocusFactor"]
[{"$nulls":7},"伤害减免百分比",52,"DamageReduceFactor"]
[{"$nulls":7},"效果命中",53,"Hit"]
[{"$nulls":7},"效果抵抗",54,"Dodge"]
[{"$nulls":7},"暴击",55,"CritFactor"]
[{"$nulls":7},"暴伤",56,"CritDamageFactor"]
[{"$nulls":7},"回复系数",57,"TreatFacter"]
[{"$nulls":7},"抗暴",58,"AntiCritTactor"]
[{"$nulls":7},"火攻（%）",101,"FireDamageBonusFactor"]
[{"$nulls":7},"风攻（%）",102,"WindDamageBonusFactor"]
{"$rows_left_out":10}